program: Gaussian 09
title: 000037668
version: EM64L-G09RevD.01
frameworkgroup: C1[X(C23H30N2)]
method: RPBEPBE
basis: SDD
operation: Freq
keyword: #pfreq=noraman
keyword: PBEPBE/SDD
title: #p freq=noraman PBEPBE/SDD
converged: YES YES NO NO
title: Mulliken charges:
elementType: N N C C C C C C C C C C C C C C C C C C C C C C C H H H H H H H H H H H H H H H H H H H H H H H H H H H H H H
charge: -0.178838 -0.072113 0.119277 -0.547783 0.253352 0.287540 -0.479647 -0.443624 0.440011 -0.363852 -0.349156 -0.368510 -0.397737 -0.396792 -0.388191 -0.395520 -0.720108 -0.399063 -0.419559 -0.381011 -0.278592 -0.225470 -0.249527 -0.248254 -0.249284 0.239692 0.220665 0.221969 0.202606 0.232094 0.213366 0.189744 0.237571 0.170590 0.202993 0.213957 0.167948 0.226005 0.191561 0.206010 0.204092 0.192461 0.239393 0.221723 0.242442 0.214860 0.214697 0.188952 0.230568 0.259203 0.219822 0.216978 0.221946 0.222103 0.226439
chargesum: 0.00000
title: Mulliken charges with hydrogens summed into heavy atoms:
elementType: N N C C C C C C C C C C C C C C C C C C C C C C C
charge: -0.178838 -0.072113 0.119277 -0.087426 0.253352 0.287540 -0.055073 0.001837 0.440011 0.063462 0.024426 0.013395 -0.171732 0.000779 0.008362 -0.156126 -0.041083 0.004586 -0.188991 -0.121808 -0.058770 -0.008491 -0.027581 -0.026152 -0.022845
polarizability: 3.12128088e+02 -3.96287783e+00 2.46986746e+02 8.82239333e+00 4.11390209e+00 2.11118182e+02
1716.lowfreq: -2.9180 -0.0005 -0.0001 0.0006 5.8167 14.1648 23.6656 25.7860 28.6993
frequency: 22.5940 25.7684 28.4739 45.9345 60.0237 61.3442 81.8757 105.0690 119.7078 135.0751 156.1209 193.1783 201.2677 214.1817 237.2150 243.0179 252.9566 275.0575 302.0862 314.1732 319.3905 342.9539 363.3805 368.9115 394.9847 405.5009 438.7405 447.2660 450.4010 490.9989 493.7124 528.5434 541.9322 558.9596 582.4027 615.6342 617.2269 638.5095 706.5572 710.8480 736.0529 742.4884 746.7868 772.2783 773.7659 781.2631 787.5874 805.9801 833.1653 843.4584 853.4592 855.3115 857.5014 903.8885 917.3106 917.9357 937.7870 958.7807 960.8634 963.8600 978.8748 984.0441 990.5059 991.7075 996.1041 1009.3791 1022.0456 1024.2196 1030.8718 1048.2428 1060.0484 1069.8572 1083.9385 1091.5755 1102.6960 1104.5063 1116.9817 1124.4668 1150.1248 1152.6633 1157.0186 1160.1973 1162.5906 1170.3071 1173.6299 1192.9785 1201.4760 1219.4734 1226.0971 1255.9654 1265.0541 1268.3422 1281.5010 1289.3665 1291.0602 1294.8925 1302.2960 1316.8790 1321.4921 1331.0573 1332.6850 1341.1542 1346.1128 1353.0352 1366.2513 1374.8076 1375.7304 1393.7084 1394.2313 1411.1917 1434.9821 1450.6090 1451.3303 1459.9215 1461.4464 1465.9364 1470.9033 1475.0590 1476.2926 1478.0673 1481.7633 1484.7912 1487.5672 1494.6536 1508.7327 1587.6274 1595.7775 1610.5601 1617.4609 2817.5315 2827.4429 2854.1518 2924.7171 2965.6085 2981.9974 2985.2934 2985.7861 2989.0924 2994.4774 3022.9075 3025.7507 3027.2229 3030.6671 3034.1112 3036.3292 3045.9233 3054.9832 3057.4240 3070.6090 3085.4973 3117.3331 3118.0610 3124.2914 3124.7611 3138.0246 3142.3865 3146.6671 3160.4234 3161.4864
redmass: 4.4770 4.1155 2.9529 3.6652 4.2771 4.5021 3.6912 3.3244 3.5048 2.9997 3.0085 1.4682 2.4252 2.2610 1.8664 2.4656 3.7804 2.5954 2.4676 3.3885 3.2277 3.4139 2.6721 2.6450 2.0637 2.8549 3.1955 2.9865 3.0467 3.2664 3.0834 4.3616 2.5131 3.1516 3.1794 4.3095 6.3343 4.1184 1.8013 4.5995 2.3102 1.8709 2.6509 2.3894 2.2137 1.3307 1.5097 1.4656 1.6597 1.6821 1.8508 1.8967 1.2880 2.3671 1.6297 1.4361 2.6202 1.3048 1.3062 2.2019 1.5618 2.2736 3.2721 2.7037 1.5383 1.8452 2.1471 3.2093 2.3121 2.0897 2.2051 2.2397 1.8241 2.2141 1.8445 1.9493 2.1941 2.3326 1.4769 1.6908 1.9902 2.1040 1.5685 1.1372 1.0670 1.9772 1.1262 2.1289 1.7458 1.3477 1.2629 1.2958 1.7860 1.3118 1.4615 1.4727 1.3523 1.3315 1.3907 1.2976 1.4247 1.4217 1.4679 1.4197 1.6873 4.4503 2.1743 1.3720 1.2132 2.9518 2.2710 2.2668 1.1087 1.0881 1.1171 1.0963 1.2047 1.1320 1.2195 1.0525 1.8514 1.0992 1.2861 1.2147 1.4947 5.8737 7.0117 6.0015 6.9517 1.0714 1.0700 1.0699 1.0690 1.0628 1.0363 1.0616 1.0610 1.0607 1.0602 1.0881 1.0935 1.0876 1.0913 1.0995 1.0917 1.1034 1.1036 1.1032 1.0990 1.0995 1.0861 1.0844 1.0876 1.0885 1.0925 1.0934 1.0949 1.0998 1.1012
irintensity: 0.0362 0.0190 0.1842 0.0071 0.2488 0.0997 0.5159 0.1677 0.6109 0.4189 0.1180 0.4977 1.1087 0.7714 0.9584 0.6740 1.9634 4.3920 2.1584 2.9653 2.8810 0.7454 1.3804 5.2878 6.2450 0.0939 4.6045 1.2951 0.1655 9.7409 1.2517 1.8473 5.3715 0.4590 8.0210 7.4477 0.3582 6.8620 45.4216 0.7245 12.3118 45.2928 47.1421 13.8331 35.3484 2.5360 7.7407 0.5547 0.7650 4.7737 2.0456 10.6355 0.1742 3.3446 6.9893 3.0909 7.4636 3.2510 0.1275 4.5277 0.2320 3.2387 0.7000 23.1086 0.2301 8.4665 23.0587 6.3762 9.5204 6.4371 7.5308 6.5413 2.7830 2.9883 11.8026 1.1644 32.3852 9.0522 17.9101 7.5742 8.3950 2.5709 31.4688 15.6037 0.7769 13.0494 1.8627 5.8502 1.2650 0.7245 5.6416 5.5293 43.4264 15.9267 2.6349 46.7748 10.4827 8.5378 2.2933 1.2407 3.8952 0.5194 0.7748 1.0761 5.9963 3.5866 3.2624 6.5225 21.0519 11.2494 5.6960 13.8491 5.6505 13.6638 8.2198 12.9114 12.2025 2.4162 16.2653 10.4790 46.0543 13.9948 20.6138 30.5391 68.6524 2.8957 7.3074 25.4086 90.8199 48.4329 107.4011 128.0174 82.6803 39.5741 37.2914 33.0933 41.0339 18.9823 36.3122 16.1087 13.3362 62.2263 77.1979 28.9659 20.8756 18.6146 93.6092 38.0229 43.4018 45.1476 8.4500 1.6521 4.8575 8.1882 15.7404 31.3084 44.4055 32.7631 24.6099
temp: 298.150 k
press: 1.00000 atm
elementType: 7 7 6 6 6 6 6 6 6 6 6 6 6 6 6 6 6 6 6 6 6 6 6 6 6 1 1 1 1 1 1 1 1 1 1 1 1 1 1 1 1 1 1 1 1 1 1 1 1 1 1 1 1 1 1
symmnumber: 1
zpe: 1251828.5 jmol-1
zpe.correction: 0.476796 hartree
zpe.thermalcorrener: 0.499864 hartree
zpe.thermalcorrenthalpy: 0.500808 hartree
zpe.thermalcorrgfe: 0.423032 hartree
zpe.sumelectzpe: -1002.074263 hartree
zpe.sumelectthermal: -1002.051196 hartree
zpe.sumelectthermalent: -1002.050252 hartree
zpe.sumelectthermalfe: -1002.128027 hartree
dipole: -1.6095 -1.5369 1.2580
dipole: 2.5564
quadrupole: -139.7668 -151.4320 -148.7911
quadrupole: 0.1276 2.2371 1.5148
quadrupole: 6.8965 -4.7687 -2.1278 0.1276 2.2371 1.5148
hfenergy: -1002.5510593 hartree
pointgroup: C01 [X(C23H30N2)]
dipole: -0.6406443 0.5860507 -0.5076481 debye
polarizability: 311.7955542|3.4489536|247.2395722|-10.778241|2.6129932|211.1978903 unknown
InChI: InChI=1S/C23H30N2/c1-2-23(20-11-5-3-6-12-20)19-25(22-14-8-7-13-21(22)23)18-17-24-15-9-4-10-16-24/h3,5-8,11-14H,2,4,9-10,15-19H2,1H3
charge 0 multiplicity 1
55 atoms
N  -0.242246 0.134304 0.309218
N  -4.063147 0.231817 0.150961
C  1.848604 0.216296 -0.943093
C  0.493472 0.974975 -0.669839
C  1.508761 -1.202801 -0.427956
C  0.28236 -1.168064 0.295252
C  2.158645 0.208624 -2.469264
C  -1.617263 0.447879 0.703256
C  3.010974 0.772551 -0.08118
C  -2.684943 -0.014964 -0.329535
C  -4.473434 1.655098 0.031714
C  -5.061572 -0.66681 -0.486051
C  2.237192 -2.393718 -0.535515
C  -5.842057 1.897673 0.700993
C  -6.448645 -0.503839 0.168429
C  -0.233252 -2.336604 0.904456
C  2.367421 1.606068 -3.094357
C  -6.918819 0.967255 0.097204
C  4.358512 0.750224 -0.525869
C  2.754482 1.248857 1.233516
C  1.731613 -3.57744 0.069497
C  0.510113 -3.53715 0.781728
C  5.410455 1.199627 0.304811
C  3.801622 1.699001 2.0654
C  5.138425 1.680143 1.604586
H  0.653689 1.993717 -0.272697
H  -0.081989 1.066246 -1.617574
H  1.313789 -0.298858 -2.974063
H  3.044143 -0.42538 -2.667436
H  -1.845319 -0.034309 1.671953
H  -1.686966 1.539555 0.865701
H  -2.488662 0.474382 -1.318354
H  -2.561494 -1.103616 -0.480386
H  -4.533167 1.961139 -1.048014
H  -3.706615 2.291984 0.508862
H  -4.709926 -1.70958 -0.375076
H  -5.150271 -0.459034 -1.586261
H  3.192593 -2.417194 -1.073667
H  -6.128967 2.959835 0.57668
H  -5.746455 1.698918 1.785861
H  -6.379537 -0.819526 1.227452
H  -7.174026 -1.171409 -0.335546
H  -1.17566 -2.322158 1.462435
H  1.468678 2.239177 -2.973961
H  3.215515 2.138314 -2.629295
H  2.569881 1.521549 -4.17785
H  -7.882217 1.093338 0.626485
H  -7.09296 1.246392 -0.963097
H  4.603052 0.381566 -1.527641
H  1.727797 1.241617 1.617334
H  2.288338 -4.516904 -0.012289
H  0.125698 -4.451744 1.248712
H  6.441825 1.174345 -0.06599
H  3.575789 2.057187 3.076551
H  5.953072 2.02945 2.248907
