program: Gaussian 09
title: 000037656
version: EM64L-G09RevD.01
frameworkgroup: C1[X(C21H26N2O)]
method: RPBEPBE
basis: SDD
operation: Freq
keyword: #p
keyword: freq=noraman
keyword: PBEPBE/SDD
title: #p freq=noraman PBEPBE/SDD
converged: YES YES NO NO
title: Mulliken charges:
elementType: O N N C C C C C C C C C C C C C C C C C C C C C H H H H H H H H H H H H H H H H H H H H H H H H H H
charge: -0.245777 -0.170665 -0.087998 0.070543 -0.485506 0.255736 0.269239 -0.430858 0.432864 -0.810351 -0.349695 -0.413459 -0.393513 -0.328836 -0.346677 -0.362352 -0.422710 -0.276174 -0.223641 -0.323670 -0.316918 -0.245938 -0.238188 -0.249376 0.224055 0.234270 0.228284 0.217161 0.237608 0.226907 0.212055 0.192654 0.228905 0.234497 0.236768 0.193325 0.202359 0.212675 0.193086 0.253610 0.239852 0.220922 0.217297 0.192674 0.214769 0.214644 0.192554 0.223708 0.222069 0.227212
chargesum: 0.00000
title: Mulliken charges with hydrogens summed into heavy atoms:
elementType: O N N C C C C C C C C C C C C C C C C C C C C C
charge: -0.245777 -0.170665 -0.087998 0.070543 -0.027181 0.255736 0.269239 0.014588 0.432864 -0.133782 0.071864 -0.178962 -0.156745 0.066849 0.059084 -0.108742 -0.182858 -0.055252 -0.006344 0.083773 0.090280 -0.022230 -0.016120 -0.022165
polarizability: 2.67060158e+02 1.39060402e+01 2.40117001e+02 -5.32053787e+00 -1.44238266e+01 2.06180635e+02
1716.lowfreq: -16.5428 -2.9646 0.0005 0.0005 0.0007 5.9507 12.9835 16.8585 22.6860
frequency: -9.7958 16.0361 22.4643 26.7640 46.0442 63.3267 69.9120 103.9452 145.2345 158.8012 191.5994 219.1063 226.1224 233.8026 240.2001 266.4603 297.5019 304.7531 317.0593 326.2718 342.2492 368.7934 399.8163 402.6241 431.0732 453.3360 467.7709 477.0619 493.5411 531.3996 562.5405 576.3128 590.0251 605.8048 617.9729 638.1665 703.3638 708.0995 740.1808 744.8492 752.4858 776.2149 779.8948 784.8837 808.4013 812.2371 839.7129 840.8032 851.8876 894.8603 901.0815 922.1930 927.8315 961.8170 963.1570 976.2368 990.3069 993.5032 995.9415 997.9674 1019.3654 1026.2864 1027.0130 1036.4091 1044.7246 1052.9272 1075.0449 1082.6789 1090.3684 1091.0229 1102.5314 1111.5455 1133.0988 1138.8126 1149.0854 1167.6056 1169.9089 1172.4642 1180.8763 1189.6999 1198.1239 1204.8421 1238.2965 1250.6807 1260.5598 1272.5018 1288.5626 1290.2048 1292.9958 1304.3937 1317.2229 1324.6215 1332.6025 1346.3040 1361.4638 1371.0475 1375.3916 1376.5792 1389.5662 1391.6814 1411.9983 1434.1118 1443.2596 1446.7018 1451.0722 1452.0329 1458.1969 1468.1005 1475.0411 1479.5706 1479.7987 1484.4026 1487.7803 1510.6057 1588.9977 1595.6946 1610.8663 1620.3986 2859.2188 2861.4443 2876.0834 2918.8197 2954.0044 2958.0731 2971.1950 2980.9488 3019.9594 3027.9739 3028.6097 3036.3158 3046.2156 3072.9652 3080.2992 3083.4910 3088.3331 3119.7118 3119.9039 3126.3386 3128.2530 3143.0258 3143.1891 3150.9757 3161.3869 3163.2360
redmass: 3.1539 5.0987 4.1088 3.8452 4.2617 3.9397 4.2092 3.8320 2.9556 4.2586 3.2811 3.1759 2.9331 2.3469 2.2410 3.3092 2.9619 1.4748 2.4661 1.9752 3.4473 3.0023 2.0567 2.8000 3.9032 4.8876 2.8228 3.2575 3.4260 4.7927 3.8171 3.3252 3.0337 3.0360 6.2345 3.6338 1.9741 3.2523 3.3250 1.3520 4.0083 2.4196 2.6061 1.3411 3.3683 3.0806 1.4307 1.5973 1.2514 2.2656 2.1728 1.4183 1.4670 1.7241 1.5156 1.3890 5.5280 1.3322 2.4427 2.6459 2.2913 2.5397 2.2036 3.4396 2.6031 1.9381 2.3152 2.1754 2.2899 2.3664 1.8242 2.3541 2.5306 2.5724 1.9676 1.2996 1.1914 1.0667 2.2132 1.0777 1.1200 2.1295 1.5148 2.3202 1.3731 1.3438 1.5837 1.3852 1.3307 1.3656 1.4014 1.3842 1.2775 1.3118 1.5855 1.3718 2.2508 4.3818 1.2225 1.4393 2.7937 2.2422 1.0827 1.1113 1.8685 1.1675 1.1004 1.2133 1.2229 1.1025 1.4423 1.1573 1.4492 2.1391 6.0090 6.9437 6.0198 6.9544 1.0708 1.0699 1.0690 1.0693 1.0665 1.0666 1.0609 1.0360 1.0905 1.0908 1.0929 1.0897 1.0990 1.0990 1.0960 1.0979 1.0998 1.0851 1.0842 1.0897 1.0878 1.0923 1.0937 1.0950 1.0997 1.1009
irintensity: 0.0324 0.1069 0.1749 0.1049 0.3117 0.7562 1.0010 1.3792 2.8041 0.4140 5.7030 1.8454 3.0269 1.1218 0.6035 1.4428 3.3542 0.7433 10.2890 0.5771 1.1723 8.6072 2.7450 0.1694 2.9302 5.6847 0.4620 4.0324 7.5239 2.8908 4.7568 1.7840 8.4958 7.8120 1.2606 3.0950 40.0677 10.8796 1.1888 97.5307 8.2486 20.9671 10.5358 12.3727 19.3205 5.3295 1.8399 0.1811 0.1065 4.9455 4.6901 1.8459 2.7373 5.1430 2.6249 0.1164 0.6217 0.0044 25.2497 16.5794 23.8002 9.8959 12.5249 5.0835 1.7779 16.9351 7.4825 2.6685 12.2195 35.8511 7.3761 3.8687 64.4352 26.4877 16.8176 4.6318 2.9873 0.0240 6.5163 3.0244 2.1073 19.2022 11.8212 12.3398 15.3133 3.0297 29.8206 50.3792 25.8587 8.3617 19.8750 2.4101 1.3310 13.2215 6.3199 2.3680 1.9370 5.1459 13.0496 3.3316 14.0806 7.8771 2.7125 0.6257 15.0300 26.1178 5.2511 5.6739 10.8998 14.7055 21.8728 19.1078 23.9710 135.9740 0.5058 5.9447 12.3961 128.8384 36.2341 54.0853 145.3389 80.0383 30.9992 102.0667 63.0799 29.1586 2.0561 43.0922 15.1282 39.7057 53.4083 27.9897 40.6558 35.7200 32.5739 5.9787 1.2824 12.2173 3.9178 17.3812 40.7699 39.2533 29.4252 18.9464
temp: 298.150 k
press: 1.00000 atm
elementType: 8 7 7 6 6 6 6 6 6 6 6 6 6 6 6 6 6 6 6 6 6 6 6 6 1 1 1 1 1 1 1 1 1 1 1 1 1 1 1 1 1 1 1 1 1 1 1 1 1 1
symmnumber: 1
zpe: 1113541.0 jmol-1
zpe.correction: 0.424125 hartree
zpe.thermalcorrener: 0.444992 hartree
zpe.thermalcorrenthalpy: 0.445937 hartree
zpe.thermalcorrgfe: 0.372415 hartree
zpe.sumelectzpe: -998.751851 hartree
zpe.sumelectthermal: -998.730984 hartree
zpe.sumelectthermalent: -998.730039 hartree
zpe.sumelectthermalfe: -998.803561 hartree
dipole: -0.5814 -0.6508 1.1915
dipole: 1.4769
quadrupole: -155.6895 -145.3121 -134.2548
quadrupole: 9.9440 -3.2739 -2.8886
quadrupole: -10.6040 -0.2266 10.8307 9.9440 -3.2739 -2.8886
hfenergy: -999.175976 hartree
pointgroup: C01 [X(C21H26N2O1)]
dipole: -0.2339314 0.2414224 -0.473938 debye
polarizability: 268.1957064|-12.1924942|238.6111801|7.1167496|-14.5103825|206.5509074 unknown
InChI: InChI=1S/C21H26N2O/c1-21(18-7-3-2-4-8-18)17-23(20-10-6-5-9-19(20)21)12-11-22-13-15-24-16-14-22/h2-10H,11-17H2,1H3
charge 0 multiplicity 1
50 atoms
O  6.427744 1.371432 0.196494
N  0.144826 -0.611793 -0.848897
N  3.74398 0.249545 0.053748
C  -2.25135 -0.258896 -1.151367
C  -0.814078 0.148926 -1.684153
C  -1.924117 -1.507848 -0.30802
C  -0.512721 -1.64271 -0.168609
C  1.59228 -0.515432 -1.016802
C  -2.820893 0.876827 -0.264249
C  -3.177457 -0.608451 -2.341477
C  2.267273 0.231538 0.164178
C  -2.787867 -2.425497 0.302394
C  0.045778 -2.704052 0.584267
C  4.242649 1.200241 -0.975486
C  4.404359 0.523725 1.3582
C  -2.236523 1.132237 1.006695
C  -3.881472 1.716543 -0.690581
C  -2.243847 -3.500946 1.057826
C  -0.841208 -3.628564 1.190462
C  5.773044 1.098533 -1.092651
C  5.93091 0.423704 1.208425
C  -2.692461 2.191504 1.819161
C  -4.344712 2.776531 0.124295
C  -3.751198 3.021778 1.381703
H  -0.710517 -0.139159 -2.754322
H  -0.644561 1.237792 -1.602338
H  2.047672 -1.523018 -1.0985
H  1.798532 0.008656 -1.968916
H  -2.763552 -1.469983 -2.893175
H  -4.191283 -0.88086 -1.997291
H  -3.269851 0.235441 -3.050255
H  1.831836 1.260147 0.239999
H  2.000621 -0.298902 1.097653
H  -3.874463 -2.314018 0.206012
H  1.129217 -2.817951 0.697726
H  3.96231 2.254295 -0.720459
H  3.793584 0.956509 -1.955953
H  4.057933 -0.222223 2.09843
H  4.143419 1.541315 1.744524
H  -1.427735 0.485795 1.364827
H  -4.362227 1.549561 -1.659852
H  -2.908442 -4.225949 1.539182
H  -0.426967 -4.458999 1.774617
H  6.049917 0.081595 -1.445954
H  6.168871 1.854914 -1.790551
H  6.442391 0.697562 2.145997
H  6.209007 -0.612704 0.918447
H  -2.2276 2.36572 2.796493
H  -5.170153 3.40791 -0.22479
H  -4.1104 3.84198 2.013493
