program: Gaussian 09
title: 000005699
version: EM64L-G09RevD.01
frameworkgroup: C1[X(C10H7NO4)]
method: RPBEPBE
basis: SDD
operation: Freq
keyword: #p
keyword: freq=noraman
keyword: PBEPBE/SDD
title: #p freq=noraman PBEPBE/SDD
converged: NO NO NO NO
title: Mulliken charges:
elementType: O O O O N C C C C C C C C C C H H H H H H H
charge: -0.465720 -0.256682 -0.460886 -0.204429 -0.435017 0.109902 0.233725 0.236033 0.137334 0.179731 -0.400121 -0.402462 -0.363773 -0.217364 0.118543 0.386107 0.282294 0.287378 0.226094 0.234664 0.374829 0.399820
chargesum: 0.00000
title: Mulliken charges with hydrogens summed into heavy atoms:
elementType: O O O O N C C C C C C C C C C
charge: -0.090891 -0.256682 -0.061065 -0.204429 -0.048910 0.109902 0.233725 0.236033 0.137334 0.179731 -0.117827 -0.115083 -0.137679 0.017300 0.118543
polarizability: 1.91414750e+02 2.65259522e+00 1.64024208e+02 5.67963479e-03 2.33990947e-03 5.01028271e+01
1716.lowfreq: -0.0008 -0.0007 0.0002 10.0890 13.2636 13.6964 66.7433 76.0426 126.2936
frequency: 66.7365 76.0326 126.2929 137.8909 185.9174 219.5857 245.1115 300.7713 312.7496 334.1231 347.6695 423.2404 482.9676 492.0484 500.2744 519.4967 528.5977 565.8541 602.8389 611.4044 614.4969 686.3326 702.2206 742.5129 748.0109 759.7214 808.5677 852.0891 889.2138 896.9861 908.3002 958.9271 985.6084 1038.2851 1058.5305 1108.5965 1118.3480 1163.0999 1198.6621 1249.3292 1276.2985 1284.3771 1295.8726 1359.1332 1422.8942 1445.1277 1480.2860 1512.8443 1541.7568 1579.4958 1614.7987 1631.6917 1662.8624 3122.2559 3152.0569 3171.9115 3185.6844 3522.0526 3549.4395 3606.5408
redmass: 11.2347 6.4494 8.2942 7.3428 4.6812 5.0902 7.4107 4.0772 9.0768 7.8712 1.1632 8.7420 3.4890 4.4135 5.4156 7.6636 8.3494 2.7533 4.7833 5.3202 1.6038 3.5872 5.5238 5.5599 1.6442 1.4200 2.2512 5.3138 7.0867 1.3762 1.5313 7.3962 1.3211 2.8330 1.9004 2.5232 1.5048 1.1581 1.5291 2.0589 2.1759 2.2479 3.8443 2.1089 6.5590 2.8954 3.0903 4.5519 9.3152 5.2384 8.6156 6.8554 9.5247 1.0896 1.0899 1.0981 1.0925 1.0776 1.0649 1.0666
irintensity: 0.0954 2.6102 0.0338 0.4238 1.9160 0.0435 9.0570 12.5479 2.9197 6.0024 139.7538 3.5099 13.2748 19.2954 5.7289 8.8628 5.8457 32.3351 24.7031 20.3266 109.0638 0.3551 12.8838 20.0013 15.6242 125.7916 45.4080 6.4879 0.2971 4.0578 37.9179 223.3275 2.5552 38.2469 31.8779 311.8859 11.7909 18.1062 37.5238 11.4255 50.5097 23.2544 40.0329 65.0049 19.5978 51.1358 10.7255 198.2767 219.3002 52.4872 99.3313 2.1131 227.3276 14.0714 5.0342 13.7853 2.3256 146.5803 70.8087 58.6324
temp: 298.150 k
press: 1.00000 atm
elementType: 8 8 8 8 7 6 6 6 6 6 6 6 6 6 6 1 1 1 1 1 1 1
symmnumber: 1
zpe: 406639.5 jmol-1
zpe.correction: 0.154881 hartree
zpe.thermalcorrener: 0.166996 hartree
zpe.thermalcorrenthalpy: 0.167940 hartree
zpe.thermalcorrgfe: 0.116572 hartree
zpe.sumelectzpe: -739.886224 hartree
zpe.sumelectthermal: -739.874110 hartree
zpe.sumelectthermalent: -739.873165 hartree
zpe.sumelectthermalfe: -739.924533 hartree
dipole: -2.0474 -7.7677 -0.0003
dipole: 8.0330
quadrupole: -71.6593 -87.9948 -88.1234
quadrupole: -0.2911 0.0016 -0.0051
quadrupole: 10.9332 -5.4023 -5.5309 -0.2911 0.0016 -0.0051
hfenergy: -740.0411052 hartree
pointgroup: C01 [X(C10H7N1O4)]
dipole: 0.9747404 -3.006369 0.0001363 debye
dipolederiv: -0.12694 -0.2895663 -0.0000472 -0.0358776 -1.3642155 0.0000437 -0.000059 0.0000337 -0.4149146 -0.4561012 -0.1732534 -0.0000289 0.0608729 -1.182219 -0.0000867 -0.0000203 0.0002995 -0.3590164 -0.4396955 -0.124055 -0.0000014 -0.3358296 -1.2751008 -0.0001642 -0.0000817 -0.0002342 -0.4367625 -1.1789287 0.0895779 0.0000031 0.064562 -0.5746328 -0.0000899 -0.0002032 -0.0000093 -0.3057268 -0.816122 0.2056211 -0.0000077 -0.0663509 -0.7338033 0.0000241 -0.0000606 0.0002199 -0.2300817 0.5666134 0.2950006 -0.0000436 0.0033283 -0.0743124 0.000044 0.0000553 -0.0001224 0.0701294 -0.0563614 0.3237309 -0.0000259 0.2281837 -0.3129079 0.0000329 0.0000368 -0.0000025 -0.0009127 -0.2176507 -0.564283 0.0000038 -0.7357347 0.5326791 -0.0000762 -0.0000099 -0.0002481 0.0818983 0.6464923 0.2966768 0.0000485 -0.1302514 1.2720764 -0.0000257 0.0000298 -0.0001764 0.1520556 -0.0604759 0.1231648 0.0000226 0.0462824 1.3054927 -0.0000369 0.0000402 0.0000206 0.0367822 -0.2099091 -0.1092144 -0.0000164 0.1705882 -0.0111529 0.0000192 -0.0000224 0.0000199 -0.1452076 -0.1795918 -0.5322812 0.0000237 0.2532488 -0.3565518 0.0000436 -0.0000329 0.0000257 -0.1719917 -0.0084666 -0.1944258 -0.0000172 0.0108243 -0.0523821 -0.0000106 -0.0000235 0.0000055 -0.1845949 0.0928931 0.1579756 -0.0000244 -0.0969026 -0.0169543 -0.0000002 -0.0000032 -0.0000312 -0.1487262 1.8575542 0.2529918 0.0001144 0.3826804 1.5873421 0.0003226 0.0003173 0.0002385 0.2488342 0.2962834 0.0444882 -0.0000006 0.0406905 0.3456596 -0.000009 0.0000084 -0.0000357 0.3265027 0.1102326 0.0213555 0.0000036 -0.0676106 0.0157626 -0.0000084 0.0000122 -0.0000008 0.1640579 0.0440447 0.0238492 -0.0000147 0.0347286 0.0985993 -0.0000025 -0.0000216 0.0000185 0.1676814 0.0074547 0.0955835 0.0000049 0.1229538 -0.045921 -0.000003 0.0000138 -0.0000024 0.1738905 -0.1027535 -0.0485841 0.0000074 -0.0467779 0.0725272 0.0000051 0.0000125 0.0000153 0.1620258 0.0952954 0.0989466 0.0000406 0.0086865 0.3975057 -0.0000123 0.0000296 -0.0000345 0.3997639 0.1361325 0.0067007 -0.0000445 0.0877047 0.372509 -0.0000097 -0.0000175 0.0000003 0.4143133 unknown
polarizability: 191.6249897|-1.1106186|163.8139676|0.0058013|-0.0020195|50.1028271 unknown
InChI: InChI=1S/C10H7NO4/c12-7-3-1-2-5-8(13)4-6(10(14)15)11-9(5)7/h1-4,11-12,14H
charge 0 multiplicity 1
22 atoms
O  1.332757 -2.769628 0.000308
O  0.164644 3.196514 -0.000249
O  -3.008175 -1.947769 -0.00042
O  -4.090993 0.118215 -0.000214
N  -0.600096 -0.899729 0.000354
C  0.722742 -0.465748 0.000365
C  1.033598 0.925987 0.000335
C  -1.645088 0.010224 0.000201
C  -0.065516 1.937917 0.000488
C  1.772166 -1.431201 0.000308
C  2.395388 1.328838 0.000234
C  -1.419334 1.378728 0.000179
C  3.111961 -1.019959 0.000234
C  3.420749 0.36967 0.000194
C  -3.030276 -0.541525 -0.000042
H  -0.798719 -1.905095 0.000259
H  2.603627 2.403199 0.00024
H  -2.273571 2.060652 0.000004
H  3.916954 -1.766035 0.000199
H  4.469426 0.683676 0.000149
H  2.08904 -3.405054 0.000159
H  -3.935585 -2.303876 -0.000685
