program: Gaussian 09
title: 000005792
version: EM64L-G09RevD.01
frameworkgroup: C1[X(C14H12N2O)]
method: RPBEPBE
basis: SDD
operation: Freq
keyword: #p
keyword: freq=noraman
keyword: PBEPBE/SDD
title: #p freq=noraman PBEPBE/SDD
converged: YES YES NO NO
title: Mulliken charges:
elementType: O N N C C C C C C C C C C C C C C H H H H H H H H H H H H
charge: -0.482741 -0.434649 -0.044469 -0.344120 0.153546 0.282086 0.471093 0.017124 -0.371284 -0.357150 -0.433234 -0.367148 -0.215480 -0.234448 -0.217917 -0.214910 -0.240093 0.234110 0.337780 0.232708 0.248340 0.236413 0.245817 0.222015 0.223841 0.362247 0.230331 0.228479 0.231710
chargesum: 0.00000
title: Mulliken charges with hydrogens summed into heavy atoms:
elementType: O N N C C C C C C C C C C C C C C
charge: -0.120494 -0.096869 -0.044469 -0.110009 0.153546 0.282086 0.471093 0.017124 -0.138577 -0.108810 -0.196820 -0.121330 0.006535 -0.010606 0.012414 0.013569 -0.008383
polarizability: 2.28153701e+02 3.02275201e+00 1.31312884e+02 1.68221808e+01 1.42827709e+01 1.31892246e+02
1716.lowfreq: -5.0514 -4.3806 0.0006 0.0008 0.0009 3.6176 17.4159 29.9666 42.6515
frequency: 16.2785 29.8332 42.6409 121.5622 160.7207 180.4034 240.0459 252.0585 288.4837 318.3991 334.1944 376.4148 401.8098 432.3601 476.6484 540.3907 557.1753 581.4940 609.7524 614.6045 616.7456 671.6383 695.7029 702.1555 738.5693 755.1825 772.0956 780.7037 819.6814 833.0020 851.9179 858.3054 877.2431 924.0966 936.4499 958.6136 975.6373 977.0915 980.7542 990.7396 998.3106 1008.9866 1025.4356 1083.0461 1109.4831 1142.2590 1158.2731 1173.8915 1186.2160 1193.0585 1206.0441 1223.5578 1263.8414 1268.2787 1300.8026 1328.3615 1348.2783 1379.7432 1389.0589 1409.3457 1441.8932 1443.9787 1475.1921 1481.8500 1525.2510 1592.7772 1596.2896 1611.7113 1633.6720 2989.2464 3122.2506 3126.9770 3128.8907 3138.9224 3141.8128 3150.1791 3156.9117 3166.0363 3170.4939 3588.2622 3590.1252
redmass: 3.8637 4.9924 5.3975 5.5571 5.4381 4.8992 4.7746 4.8678 1.8864 5.0560 1.8965 5.1681 2.7838 2.9867 4.6212 4.0203 6.8160 3.7500 6.3284 6.3987 6.2324 5.7033 1.1105 1.7562 3.0657 1.3793 3.5722 2.5339 5.0411 3.8535 1.2505 1.5183 5.6804 1.4942 1.3826 7.0826 1.3043 1.4176 4.6710 5.9083 1.3435 2.2045 2.1894 1.5949 1.6321 1.2771 1.1497 1.0618 1.1225 2.1023 2.5537 1.4223 2.8724 1.3647 1.7751 1.3458 1.5617 4.7283 6.3385 2.9810 3.5931 2.1639 3.4025 2.2902 6.1057 7.0526 6.0929 6.0925 7.7462 1.0847 1.0865 1.0869 1.0852 1.0916 1.0903 1.0963 1.0958 1.1016 1.0993 1.0676 1.0799
irintensity: 0.1224 3.0791 0.2297 2.0929 3.8099 1.3207 1.3142 7.0456 80.9739 10.1159 79.2345 3.4481 0.4414 12.2174 5.3220 14.0843 7.4254 0.6396 6.6572 0.1615 5.8430 1.3228 84.4761 52.8622 53.9584 115.8120 6.0770 24.2945 5.2799 3.4416 0.5518 0.1463 7.5857 6.2687 4.4539 47.7081 0.0916 0.6100 20.6724 0.4768 0.2559 9.4691 5.9886 7.9348 1.8369 88.5753 3.8666 0.1776 2.1867 7.6792 11.7543 44.8459 28.6187 5.1306 2.5597 39.8626 74.1032 22.9608 2.2389 3.7901 28.5754 13.0180 1.3131 8.2420 36.3246 2.0579 0.4599 1.6783 4.3732 24.6231 4.9044 0.4186 0.4038 11.9484 12.3803 34.4254 27.2356 23.0555 21.5972 31.2214 64.1567
temp: 298.150 k
press: 1.00000 atm
elementType: 8 7 7 6 6 6 6 6 6 6 6 6 6 6 6 6 6 1 1 1 1 1 1 1 1 1 1 1 1
symmnumber: 1
zpe: 596700.8 jmol-1
zpe.correction: 0.227271 hartree
zpe.thermalcorrener: 0.240759 hartree
zpe.thermalcorrenthalpy: 0.241703 hartree
zpe.thermalcorrgfe: 0.184905 hartree
zpe.sumelectzpe: -724.243810 hartree
zpe.sumelectthermal: -724.230323 hartree
zpe.sumelectthermalent: -724.229378 hartree
zpe.sumelectthermalfe: -724.286176 hartree
dipole: -2.4621 1.9306 1.7089
dipole: 3.5651
quadrupole: -83.6218 -95.1630 -94.6288
quadrupole: 0.6343 4.9689 2.2677
quadrupole: 7.5161 -4.0251 -3.4909 0.6343 4.9689 2.2677
hfenergy: -724.4710814 hartree
pointgroup: C01 [X(C14H12N2O1)]
dipole: 0.9523917 -0.9125602 0.476943 debye
polarizability: 227.244042|2.4313327|136.5138265|-19.8593172|-12.7768787|127.6009621 unknown
InChI: InChI=1S/C14H12N2O/c17-13(10-6-2-1-3-7-10)14-15-11-8-4-5-9-12(11)16-14/h1-9,13,15,17H
charge 0 multiplicity 1
29 atoms
O  1.007289 -2.391523 -1.079824
N  -1.166231 -1.232534 -0.136366
N  -0.820686 0.785147 -1.151628
C  1.048521 -0.925695 -1.319017
C  -0.309535 -0.427203 -0.888418
C  -2.329926 -0.49138 0.10821
C  2.209142 -0.274131 -0.568971
C  -2.093951 0.777847 -0.531652
C  -3.527535 -0.780796 0.793844
C  -3.082437 1.786744 -0.480497
C  3.192988 0.452717 -1.279737
C  2.326679 -0.413221 0.837986
C  -4.500778 0.241104 0.831486
C  -4.281813 1.503933 0.205386
C  4.284094 1.03692 -0.596402
C  3.417187 0.165562 1.520252
C  4.399573 0.892214 0.804555
H  1.164615 -0.72047 -2.402142
H  -0.957115 -2.204998 0.087668
H  -3.704768 -1.747488 1.276878
H  -2.909052 2.75346 -0.9628
H  3.099073 0.572055 -2.366129
H  1.559622 -0.9661 1.392352
H  -5.446763 0.060747 1.354153
H  -5.064988 2.267969 0.260846
H  1.930126 -2.743438 -1.136576
H  5.038459 1.60288 -1.153842
H  3.501153 0.058145 2.607536
H  5.243957 1.344731 1.336348
