program: Gaussian 09
title: 000037629
version: EM64L-G09RevD.01
frameworkgroup: C1[X(C22H28BrNOS)]
method: RPBEPBE
basis: SDD
operation: Freq
keyword: #p
keyword: freq=noraman
keyword: PBEPBE/SDD
title: #p freq=noraman PBEPBE/SDD
converged: NO YES NO NO
title: Mulliken charges:
elementType: Br S O N C C C C C C C C C C C C C C C C C C C C C C H H H H H H H H H H H H H H H H H H H H H H H H H H H H
charge: -0.003908 0.223019 -0.471758 -0.198369 -0.444089 -0.219023 -0.360031 -0.322039 0.634770 -0.353893 -0.362438 -0.790331 0.463746 -0.708983 -0.339613 -0.338623 0.231675 0.482770 -0.251340 -0.693447 -0.693576 -0.304492 -0.456112 -0.532979 -0.240243 -0.212424 0.230220 0.240014 0.205681 0.196946 0.207660 0.195424 0.209671 0.202009 0.199338 0.208503 0.186708 0.298007 0.193244 0.191849 0.191816 0.196533 0.363457 0.244361 0.217268 0.212713 0.213136 0.218334 0.209139 0.215168 0.246725 0.252791 0.263993 0.251024
chargesum: 0.00000
title: Mulliken charges with hydrogens summed into heavy atoms:
elementType: Br S O N C C C C C C C C C C C C C C C C C C C C C C
charge: -0.003908 0.223019 -0.108301 -0.198369 0.026145 -0.013342 0.044575 0.083056 0.634770 0.047453 0.032773 -0.790331 0.463746 -0.410976 0.045481 0.049726 0.231675 0.482770 -0.006979 -0.050331 -0.050935 -0.057768 -0.203322 -0.268985 -0.240243 0.038600
polarizability: 4.23953952e+02 -3.99381699e+01 2.90945178e+02 1.99218320e+00 4.78009097e+01 1.89855709e+02
1716.lowfreq: -15.4386 -4.8525 -0.0012 -0.0009 0.0003 3.7805 8.7957 12.6591 22.5424
frequency: -8.1620 12.4073 22.4103 31.9466 38.2300 47.6292 51.2210 62.0057 79.9122 99.5255 100.1635 107.7094 113.3412 136.6231 148.0836 158.7672 170.6027 177.8045 196.8791 226.3516 229.9175 245.4287 263.2505 272.4177 278.1926 296.4190 331.3235 338.8097 356.3222 366.6462 387.3320 434.1510 437.4898 470.2251 478.3300 487.1427 494.1249 514.2404 561.7573 592.1566 602.8498 621.9714 633.1455 652.4369 677.7888 708.6610 731.0550 732.1993 732.9427 765.0547 784.4788 789.9608 793.3575 805.4818 828.3455 832.8869 850.0956 877.9249 891.6925 892.6959 894.8621 899.8933 900.7565 925.5239 929.8621 934.2001 975.2811 988.6356 1006.0092 1021.1813 1033.3191 1054.5223 1060.1639 1062.5654 1068.7709 1074.2610 1076.0699 1093.8116 1108.8446 1113.2628 1120.1438 1146.4839 1160.7113 1185.3638 1191.4320 1223.1314 1232.0997 1237.7829 1245.7484 1260.5380 1268.3356 1269.4644 1276.2347 1281.1192 1285.2942 1286.2006 1289.5297 1299.0304 1309.6316 1342.1766 1343.4745 1345.6629 1357.5658 1365.5677 1367.9081 1375.8101 1390.4279 1392.2132 1394.4853 1409.7246 1427.8091 1443.0448 1459.6102 1465.1030 1468.0992 1470.1335 1471.0541 1476.6812 1477.3212 1479.8422 1481.2717 1488.8253 1489.4149 1489.8647 1520.6013 1562.8391 1579.7026 1617.6221 2889.8440 2895.3159 2898.3959 2957.1028 2963.2891 2965.5790 2974.8204 2974.9609 2978.1908 2978.9118 3005.0216 3006.5114 3017.2292 3026.4955 3045.3682 3049.5991 3069.2799 3071.7651 3072.4082 3074.4844 3075.4444 3106.5822 3137.2472 3156.5850 3164.2062 3173.7888 3178.6840 3236.6082
redmass: 4.8462 5.5093 4.0872 3.2834 4.4378 1.9754 1.6758 3.1861 5.4129 2.9837 5.1388 3.2252 4.6587 6.1597 2.7200 4.7853 2.9437 4.2207 3.0498 1.1459 1.1848 6.7541 2.8400 5.2281 7.5220 2.7701 3.9449 3.9467 4.4652 6.8969 4.1704 2.9640 4.0131 3.2335 3.6743 3.7715 3.2155 4.0880 3.6735 4.9798 5.9317 3.7433 8.6797 7.0512 2.3162 4.7647 1.1305 1.1150 1.8136 4.1913 1.1775 1.2308 1.1484 1.7457 1.7087 3.7082 3.3567 3.4388 1.4140 1.7476 5.2866 1.7447 1.7587 1.2714 1.2489 1.4544 1.4992 2.9972 4.8110 3.1922 3.0275 3.6928 2.4792 2.7506 2.4004 2.2295 2.4439 2.0211 1.3762 2.2625 2.2241 1.4788 1.6920 2.0537 1.3695 1.3128 1.4119 1.4644 1.9715 1.7063 1.2974 1.2878 1.2674 1.0903 1.2091 1.2958 1.1865 1.2646 1.2596 1.4725 1.4761 1.3490 3.0133 2.2292 1.5283 1.7644 1.2442 1.2910 2.5409 2.2125 3.0406 5.3513 1.0879 1.0755 1.0788 1.0707 1.0734 1.0425 1.0437 1.0678 1.0670 1.0980 3.0438 1.2459 6.0855 9.0518 6.4926 7.2770 1.0698 1.0712 1.0808 1.0669 1.0589 1.0587 1.0382 1.0381 1.0577 1.0585 1.0990 1.0968 1.0925 1.0929 1.1030 1.0999 1.0954 1.1008 1.1005 1.0995 1.0994 1.0629 1.0894 1.0909 1.0920 1.0961 1.0911 1.1000
irintensity: 0.0490 0.0403 0.0080 0.0420 0.4024 0.5690 0.0718 1.1160 0.9247 0.2475 1.3906 0.3257 0.1355 0.3654 0.1965 2.7295 0.6921 1.3389 2.4354 0.0451 0.0887 0.3909 0.5257 0.9352 7.0517 1.4654 0.6918 6.5611 5.2859 3.2785 2.8315 3.5091 1.3249 13.1607 2.2691 3.2172 3.2229 2.8334 4.6386 1.6977 4.0039 1.9060 9.6488 1.5133 33.7985 15.7174 11.0705 3.0866 39.2277 32.6445 62.3165 14.5990 24.9076 2.5446 36.0620 29.1852 3.3455 11.4864 1.6578 11.5797 19.2918 16.7191 8.1610 15.8383 1.7175 27.1665 11.2083 10.8082 51.5867 10.2080 6.3210 22.2727 25.6211 81.4074 2.4946 24.4858 10.7164 30.2181 20.6001 1.0423 6.2335 17.7220 14.5684 15.3117 7.7067 3.6824 12.4410 12.6413 9.4305 12.7038 1.2493 1.8293 7.8020 0.6643 4.3213 2.7970 3.6248 10.9740 11.0312 0.9921 3.3786 3.7420 3.7773 52.5673 8.1218 17.7383 13.7149 10.4838 10.0983 22.9979 18.1695 10.3037 8.3718 0.3301 4.6153 1.3038 1.6643 12.1694 12.4894 3.4627 3.5373 16.6990 34.7103 33.5310 6.8344 6.8857 54.5640 13.6025 23.4731 115.8145 52.7752 36.9549 25.1132 22.0571 34.5120 25.2727 50.1493 54.2449 5.8077 5.6646 5.7080 5.2586 41.3323 53.3086 15.4153 85.2238 87.0073 54.9829 52.2864 369.4843 5.8108 0.1577 1.4896 6.9101 4.2939 1.1202
temp: 298.150 k
press: 1.00000 atm
elementType: 35 16 8 7 6 6 6 6 6 6 6 6 6 6 6 6 6 6 6 6 6 6 6 6 6 6 1 1 1 1 1 1 1 1 1 1 1 1 1 1 1 1 1 1 1 1 1 1 1 1 1 1 1 1
symmnumber: 1
zpe: 1171801.8 jmol-1
zpe.correction: 0.446316 hartree
zpe.thermalcorrener: 0.472819 hartree
zpe.thermalcorrenthalpy: 0.473763 hartree
zpe.thermalcorrgfe: 0.386017 hartree
zpe.sumelectzpe: -1394.693285 hartree
zpe.sumelectthermal: -1394.666782 hartree
zpe.sumelectthermalent: -1394.665837 hartree
zpe.sumelectthermalfe: -1394.753583 hartree
dipole: 4.6104 -0.2837 -2.5925
dipole: 5.2969
quadrupole: -168.9594 -162.2007 -178.6242
quadrupole: 3.7434 -2.8786 6.3340
quadrupole: 0.9687 7.7274 -8.6961 3.7434 -2.8786 6.3340
hfenergy: -1395.1396005 hartree
pointgroup: C01 [X(C22H28Br1N1O1S1)]
dipole: 1.8047348 0.2190794 1.018767 debye
polarizability: 415.6182327|51.9403494|293.741997|-5.2962143|52.6569919|195.3946095 unknown
InChI: InChI=1S/C22H28BrNOS/c1-3-5-10-24(11-6-4-2)15-21(25)20-13-16-7-8-17(23)14-19(16)18-9-12-26-22(18)20/h7-9,12-14,21,25H,3-6,10-11,15H2,1-2H3
charge 0 multiplicity 1
54 atoms
Br -7.400176 -1.379669 -0.077472
S  -0.678847 2.947913 1.164023
O  1.380306 -0.182475 -1.65823
N  3.123205 -0.029927 0.31657
C  1.712419 0.233188 0.715488
C  0.911518 0.659299 -0.568721
C  3.746485 -1.174932 1.044693
C  3.962026 1.206556 0.314425
C  -0.58784 0.505105 -0.380061
C  3.268226 -2.551323 0.538587
C  5.151019 1.140066 -0.66636
C  -1.34236 1.448309 0.383163
C  -2.738403 1.327024 0.609416
C  -1.278951 -0.572958 -0.933254
C  3.915224 -3.71876 1.319321
C  5.998527 2.433239 -0.646193
C  -3.445186 0.198368 0.048387
C  -2.69043 -0.75525 -0.736175
C  -3.272516 2.417201 1.402333
C  3.447373 -5.101074 0.815803
C  7.200087 2.370265 -1.613691
C  -4.849975 -0.001693 0.234252
C  -3.37858 -1.872548 -1.309694
C  -2.329213 3.349964 1.773872
C  -5.469464 -1.109757 -0.342935
C  -4.751179 -2.060614 -1.122734
H  1.626718 1.003161 1.511188
H  1.274237 -0.705056 1.096418
H  1.13699 1.729257 -0.789621
H  3.564139 -1.093554 2.143364
H  4.840617 -1.108191 0.900618
H  4.332773 1.432202 1.343549
H  3.31213 2.052878 0.02034
H  3.509141 -2.638731 -0.539334
H  2.165506 -2.629373 0.619159
H  4.761438 0.960605 -1.68771
H  5.80353 0.278337 -0.42059
H  -0.710673 -1.278638 -1.547388
H  3.675402 -3.617403 2.397676
H  5.019471 -3.649097 1.23781
H  6.362662 2.618144 0.385266
H  5.35557 3.297617 -0.909779
H  2.330566 -0.393537 -1.359441
H  -4.323562 2.509117 1.685062
H  3.923213 -5.92062 1.3847
H  2.351334 -5.209853 0.918732
H  3.698304 -5.239839 -0.252471
H  7.791539 3.303508 -1.5846
H  7.875235 1.533626 -1.35254
H  6.862704 2.215936 -2.655686
H  -5.433797 0.708927 0.825396
H  -2.81016 -2.592837 -1.908821
H  -2.459155 4.257474 2.360873
H  -5.269467 -2.916277 -1.563486
