program: Gaussian 09
title: 000037618
version: EM64L-G09RevD.01
frameworkgroup: C1[X(C14H11NO3)]
method: RPBEPBE
basis: SDD
operation: Freq
keyword: #p
keyword: freq=noraman
keyword: PBEPBE/SDD
title: #p freq=noraman PBEPBE/SDD
converged: YES YES NO NO
title: Mulliken charges:
elementType: O O O N C C C C C C C C C C C C C C H H H H H H H H H H H
charge: -0.342952 -0.256955 -0.206078 -0.455015 0.479345 0.403506 0.409704 -0.532360 -0.312001 -0.441600 -0.342897 -0.391586 -0.196961 -0.194210 -0.211524 0.242362 -0.253561 -0.196541 0.294568 0.310234 0.225562 0.295764 0.338463 0.238573 0.236145 0.229922 0.229069 0.231960 0.169064
chargesum: 0.00000
title: Mulliken charges with hydrogens summed into heavy atoms:
elementType: O O O N C C C C C C C C C C C C C C
charge: -0.342952 -0.256955 -0.206078 -0.116552 0.479345 0.403506 0.409704 -0.237791 -0.001767 -0.216038 -0.047133 -0.153013 0.039184 0.035713 0.017545 0.242362 -0.021601 -0.027477
polarizability: 2.94160276e+02 9.77696905e-01 1.81933265e+02 1.48219330e-01 -3.62150198e-01 6.39247218e+01
1716.lowfreq: -7.7301 -3.4354 -0.0009 -0.0001 0.0003 2.2929 10.6038 30.3161 61.1665
frequency: 7.6454 30.3008 61.1550 63.1584 90.6457 123.1639 136.7016 209.3215 215.8701 233.2775 249.7269 264.9168 342.7452 356.0705 406.5049 437.8763 446.7519 508.4129 509.9406 553.4184 612.8789 630.2254 634.8038 647.7894 687.6415 693.6642 698.9347 699.7813 739.5867 768.4515 804.3422 841.2771 850.6851 898.4582 915.7382 919.1963 930.7483 973.7324 978.9901 985.4140 994.2274 996.7688 999.2468 999.4593 1028.6532 1089.7524 1092.6980 1132.9110 1145.6797 1174.2798 1186.7604 1190.5349 1225.8826 1260.6499 1281.5181 1325.1724 1376.4262 1386.2145 1397.5698 1432.2291 1444.6287 1466.6073 1486.1897 1516.4995 1578.4501 1601.8127 1604.9175 1617.4049 1626.2328 1683.7571 2875.7711 3115.1157 3129.8082 3135.2743 3147.7638 3157.1076 3165.1888 3168.1002 3192.7530 3205.9215 3541.4516
redmass: 5.0416 6.2193 6.3968 6.9575 5.5365 5.2060 8.1005 3.6631 6.2137 6.9722 3.6934 3.6811 8.2831 5.7655 2.9046 6.3671 2.8411 2.8693 8.0670 4.5105 6.4874 6.9336 6.9497 1.7624 2.4098 2.1010 3.7715 3.8749 6.6400 1.6575 1.3610 1.2630 5.5680 6.6249 1.4307 1.3560 1.4244 1.3607 5.0516 6.1810 1.5493 1.3136 3.5436 1.5667 2.1128 1.5967 1.6411 1.9462 3.7456 1.0505 1.1763 1.1126 3.6651 2.1397 1.3420 1.3985 1.5934 7.0799 4.5678 2.3139 2.6783 2.5364 2.2304 2.1629 6.6720 5.5772 6.2369 6.0777 6.8196 9.6280 1.0851 1.0890 1.0884 1.0869 1.0934 1.0952 1.0924 1.0997 1.0951 1.0948 1.0762
irintensity: 2.8721 2.1997 1.5131 2.7236 1.6571 4.1478 8.8340 3.7614 3.1441 0.1401 0.0098 8.5019 13.3302 0.1489 0.0085 0.0911 5.8609 26.4684 13.3505 0.0017 1.6764 0.8891 22.8791 11.3723 0.0424 0.3714 68.6824 69.6427 39.2841 110.7044 60.0679 0.4478 0.6066 141.2766 12.3218 6.1965 13.5157 0.1020 59.5394 0.1325 3.3735 1.0503 111.5282 14.4650 0.7032 54.4949 13.2755 53.3271 756.0249 0.5678 67.1678 6.0538 368.5931 11.3647 7.0710 49.3052 37.3355 54.3101 7.0102 278.3522 121.8383 56.6250 13.5020 479.5643 75.0576 41.4020 97.2858 84.5930 85.2182 243.6299 139.6967 13.0124 4.6500 0.5530 26.5032 18.3957 5.6897 23.8650 5.3597 8.2961 32.5104
temp: 298.150 k
press: 1.00000 atm
elementType: 8 8 8 7 6 6 6 6 6 6 6 6 6 6 6 6 6 6 1 1 1 1 1 1 1 1 1 1 1
symmnumber: 1
zpe: 570243.9 jmol-1
zpe.correction: 0.217194 hartree
zpe.thermalcorrener: 0.232498 hartree
zpe.thermalcorrenthalpy: 0.233442 hartree
zpe.thermalcorrgfe: 0.171375 hartree
zpe.sumelectzpe: -819.265370 hartree
zpe.sumelectthermal: -819.250066 hartree
zpe.sumelectthermalent: -819.249122 hartree
zpe.sumelectthermalfe: -819.311190 hartree
dipole: -1.7904 -1.2696 -0.1010
dipole: 2.1971
quadrupole: -92.1398 -102.7337 -109.2810
quadrupole: -22.6184 -0.1750 -0.1881
quadrupole: 9.2450 -1.3488 -7.8962 -22.6184 -0.1750 -0.1881
hfenergy: -819.4825641 hartree
pointgroup: C01 [X(C14H11N1O3)]
dipole: 0.6743228 0.3588079 0.404675 debye
polarizability: 293.5934468|1.752318|109.5807612|8.27649|57.6371264|136.8440553 unknown
InChI: InChI=1S/C14H11NO3/c16-10-11-5-4-8-13(9-11)18-14(17)15-12-6-2-1-3-7-12/h1-10,15H
charge 0 multiplicity 1
29 atoms
O  -0.538708 -0.19097 -0.323185
O  0.699295 1.034275 1.313057
O  -5.089869 -1.633914 -2.184136
N  1.694917 -0.289541 -0.380312
C  3.090586 -0.136198 -0.138184
C  -1.857928 0.153139 0.075996
C  -4.219656 -0.203819 -0.415404
C  -2.856756 -0.462834 -0.70043
C  -2.192173 1.030594 1.140965
C  3.976631 -0.820138 -1.012543
C  3.609306 0.655613 0.919341
C  -4.572615 0.670736 0.646082
C  -3.557571 1.278288 1.412616
C  5.37019 -0.713885 -0.832242
C  5.007939 0.7506 1.08514
C  0.649244 0.273674 0.320229
C  5.895995 0.073105 0.218948
C  -5.289558 -0.844041 -1.223423
H  -2.593726 -1.138203 -1.520514
H  -1.40626 1.498762 1.734686
H  3.576028 -1.432584 -1.8305
H  2.927105 1.181005 1.59044
H  1.417284 -0.884501 -1.164369
H  -5.629639 0.867323 0.862134
H  -3.817864 1.95438 2.23364
H  6.043534 -1.245955 -1.512943
H  5.404003 1.362898 1.902852
H  6.978727 0.155673 0.35917
H  -6.33096 -0.571381 -0.914612
