program: Gaussian 09
title: 000005804
version: EM64L-G09RevD.01
frameworkgroup: C1[X(C15H11I3O4)]
method: RPBEPBE
basis: SDD
operation: Freq
keyword: #p
keyword: freq=noraman
keyword: PBEPBE/SDD
title: #p freq=noraman PBEPBE/SDD
converged: NO YES NO NO
title: Mulliken charges:
elementType: I I I O O O O C C C C C C C C C C C C C C C H H H H H H H H H H H
charge: 0.151521 0.151744 0.105136 -0.278319 -0.411291 -0.228988 -0.404393 -0.565791 0.519896 -0.482733 -0.361208 -0.360191 0.508094 -0.474011 -0.473819 0.343088 0.190913 -0.228271 -0.349649 -0.515433 -0.288080 0.389172 0.241110 0.242408 0.268129 0.267917 0.260283 0.260103 0.272099 0.263475 0.262755 0.380741 0.343593
chargesum: 0.00000
title: Mulliken charges with hydrogens summed into heavy atoms:
elementType: I I I O O O O C C C C C C C C C C C C C C C
charge: 0.151521 0.151744 0.105136 -0.278319 -0.030550 -0.228988 -0.060800 -0.082274 0.519896 0.053313 -0.100925 -0.100088 0.508094 -0.474011 -0.473819 0.343088 0.190913 0.043828 -0.086174 -0.515433 -0.025326 0.389172
polarizability: 2.92096873e+02 -2.73246093e+01 2.28538959e+02 3.83915429e-01 -1.23349248e-01 2.25615895e+02
1716.lowfreq: -6.9792 -4.2645 -1.2847 -0.0002 0.0002 0.0003 4.1755 8.9802 12.2266
frequency: -1.8566 8.1691 12.0235 12.3721 16.9205 40.6462 56.3368 72.6888 88.2063 110.4626 140.8164 144.7621 162.4534 163.3640 174.7317 191.0073 197.8696 224.0331 233.8144 309.7201 338.8144 355.3460 364.0933 405.4753 419.5677 436.4682 456.0759 494.7518 499.5918 501.7311 515.2761 527.0087 549.1273 577.8739 637.0395 638.9872 651.4925 689.7211 692.4746 693.1119 755.4474 780.9769 796.4687 820.1878 847.0552 848.0716 859.1441 880.8264 897.8444 910.9867 952.1589 1006.9397 1010.6063 1021.3435 1032.6403 1077.1865 1113.5134 1148.2221 1158.3799 1167.4834 1196.3756 1202.4245 1227.9029 1240.8099 1252.1495 1268.2845 1293.4395 1301.1944 1345.4096 1367.9726 1376.8611 1384.5765 1409.8796 1425.1965 1441.9657 1465.1616 1477.1287 1536.8613 1578.1128 1583.4132 1613.1787 1664.9535 3000.4866 3017.6714 3047.2688 3080.1187 3153.2428 3156.7714 3165.4966 3171.0720 3184.9052 3468.7520 3512.1548
redmass: 8.2580 19.1408 13.7620 13.3077 11.8725 39.5840 7.8863 2.2243 21.4371 6.1054 5.1476 10.1771 14.1043 4.6316 4.0198 8.6443 8.3169 12.0708 10.3932 7.0232 5.9042 4.3012 7.9317 1.1086 5.2768 3.1877 4.3447 5.1928 8.1264 2.1578 3.7694 5.4201 3.7026 5.0451 4.2310 1.3367 5.9298 5.1524 6.2154 5.2920 7.7362 1.3841 6.4842 1.4211 6.9919 1.4974 2.3096 4.3052 1.3511 2.8656 1.3435 3.1565 1.8679 4.0651 3.5940 2.4272 1.3439 1.2435 1.7668 1.7850 1.6236 1.6541 4.0754 1.4194 2.7373 1.1863 1.6626 1.7607 6.3985 1.8310 2.5774 4.8351 3.9160 3.8855 1.0935 3.0843 1.0929 7.9765 6.9695 7.1357 7.3741 8.3018 1.0612 1.0603 1.0991 1.1031 1.0919 1.0929 1.0884 1.0922 1.0978 1.0649 1.0640
irintensity: 0.3888 0.3206 0.0976 0.0928 0.5349 0.0325 0.2940 0.4156 0.3189 0.0030 0.4492 2.0477 1.0562 0.2471 0.6828 0.5303 0.3057 2.0300 0.2938 3.7665 0.0515 5.4043 9.0167 136.1296 7.6682 0.5487 24.3683 0.0391 15.4582 12.9220 22.3786 31.3163 1.9685 10.1236 18.7415 125.8623 1.1299 26.1066 18.5101 36.8374 34.9860 12.7764 21.9552 26.4650 19.7486 27.0121 1.0637 47.6299 0.0409 3.7714 0.0022 24.8383 0.7426 196.0001 24.1143 111.1427 9.4816 3.1812 14.6763 327.1847 6.0962 54.7866 116.4093 2.0206 65.7113 0.0465 24.7342 36.1167 3.9883 74.2212 40.2055 33.5433 7.3669 146.3090 55.2517 308.1938 14.3260 70.7956 18.9978 27.4064 16.1800 230.6696 4.9363 15.3050 0.6135 12.9042 0.5603 6.6410 3.2697 0.9830 2.0065 50.9592 24.1835
temp: 298.150 k
press: 1.00000 atm
elementType: 53 53 53 8 8 8 8 6 6 6 6 6 6 6 6 6 6 6 6 6 6 6 1 1 1 1 1 1 1 1 1 1 1
symmnumber: 1
zpe: 583186.1 jmol-1
zpe.correction: 0.222124 hartree
zpe.thermalcorrener: 0.243890 hartree
zpe.thermalcorrenthalpy: 0.244835 hartree
zpe.thermalcorrgfe: 0.162510 hartree
zpe.sumelectzpe: -912.026690 hartree
zpe.sumelectthermal: -912.004923 hartree
zpe.sumelectthermalent: -912.003979 hartree
zpe.sumelectthermalfe: -912.086303 hartree
dipole: -1.4039 2.5775 -0.0878
dipole: 2.9363
quadrupole: -176.2182 -162.0056 -167.9321
quadrupole: -9.1521 0.5642 -0.0979
quadrupole: -7.4996 6.7130 0.7865 -9.1521 0.5642 -0.0979
hfenergy: -912.2488136 hartree
pointgroup: C01 [X(C15H11I3O4)]
dipole: 0.8124471 0.8211172 0.0159024 debye
polarizability: 301.7782501|6.1442307|218.8613816|-0.0435977|0.1091053|225.6120961 unknown
InChI: InChI=1S/C15H11I3O4/c16-10-7-9(2-3-13(10)19)22-15-11(17)5-8(6-12(15)18)1-4-14(20)21/h2-3,5-7,19-20H,1,4H2
charge 0 multiplicity 1
33 atoms
I  -0.643527 -1.472405 3.080602
I  -0.636221 -1.457077 -3.083292
I  -2.885302 3.79589 0.001094
O  -1.692382 -1.670737 -0.002923
O  6.045345 2.515089 0.041401
O  6.722829 0.294472 -0.028289
O  -5.81333 2.180093 -0.002127
C  4.000025 -0.664374 0.006142
C  2.501833 -0.926352 0.003716
C  4.308347 0.852817 0.015581
C  1.790857 -1.035428 -1.217287
C  1.78801 -1.042004 1.222425
C  -0.324377 -1.3504 -0.000694
C  0.393907 -1.252399 1.219199
C  0.396762 -1.245996 -1.218387
C  -2.661997 -0.627367 -0.002448
C  5.798805 1.13623 0.00693
C  -2.324849 0.741445 -0.001086
C  -4.00972 -1.048044 -0.003602
C  -3.368371 1.690841 -0.000949
C  -5.032499 -0.087015 -0.003444
C  -4.730534 1.298785 -0.002145
H  4.473517 -1.131262 0.88808
H  4.475383 -1.120339 -0.880355
H  3.856328 1.35643 -0.860361
H  3.866728 1.34535 0.902681
H  2.330277 -0.969868 -2.167193
H  2.325169 -0.981418 2.173943
H  -1.279756 1.060644 -0.000159
H  -4.236491 -2.117384 -0.00459
H  -6.086184 -0.379364 -0.004302
H  7.028076 2.676282 0.031726
H  -5.495456 3.123164 -0.001189
