program: Gaussian 09
title: 000037587
version: EM64L-G09RevD.01
frameworkgroup: C1[X(C13H16N2)]
method: RPBEPBE
basis: SDD
operation: Freq
keyword: #pfreq=noraman
keyword: PBEPBE/SDD
title: #p freq=noraman PBEPBE/SDD
converged: NO YES NO NO
title: Mulliken charges:
elementType: N N C C C C C C C C C C C C C H H H H H H H H H H H H H H H H
charge: -0.466479 -0.063783 -0.145617 -0.451019 -0.451007 -0.393483 -0.393475 -0.388886 0.171439 0.271695 0.023904 -0.378647 -0.362095 -0.218976 -0.233847 0.199148 0.206986 0.231579 0.231563 0.206976 0.187648 0.203301 0.203303 0.187646 0.196891 0.199707 0.302469 0.230588 0.247021 0.222086 0.223361
chargesum: 0.00000
title: Mulliken charges with hydrogens summed into heavy atoms:
elementType: N N C C C C C C C C C C C C C
charge: -0.164010 -0.063783 0.053531 -0.012453 -0.012469 -0.002533 -0.002526 0.007712 0.171439 0.271695 0.023904 -0.148058 -0.115073 0.003111 -0.010486
polarizability: 2.23507469e+02 3.75645033e+00 1.36359719e+02 1.26837350e-02 4.87737868e-02 9.52446766e+01
1716.lowfreq: -11.7702 -3.9822 -0.0007 -0.0006 -0.0005 7.3398 14.2099 59.8110 70.8081
frequency: 12.7226 59.7167 70.8054 187.4128 190.3536 225.3645 244.6380 251.8548 325.5776 369.0877 406.0476 426.1125 445.7303 470.7438 508.6636 556.0373 582.1258 600.5067 612.9882 710.7308 724.5927 754.5753 771.0906 784.2394 784.4657 830.0211 856.8191 860.3381 872.2284 888.5232 891.7686 918.9211 934.4775 961.3209 975.3566 1004.1247 1017.8424 1045.5523 1050.5151 1071.4214 1109.7804 1111.2908 1119.4474 1159.3936 1172.2341 1180.3726 1210.6219 1234.8676 1252.0110 1260.2669 1264.3073 1274.0770 1293.4851 1311.1557 1318.5984 1334.2982 1337.6891 1341.4705 1349.7900 1387.0245 1412.4196 1441.5175 1461.4354 1461.6808 1465.1024 1469.1297 1473.9638 1477.7148 1515.2108 1593.3391 1633.2292 2940.6880 2959.7902 2960.6479 2968.6531 2983.0971 2985.8808 3023.6249 3026.6743 3034.5546 3045.3691 3053.4344 3127.4851 3139.4990 3155.5408 3169.3858 3591.8594
redmass: 3.7946 4.0099 3.5338 2.8529 4.6044 1.7790 5.2394 4.6293 1.8792 4.5016 2.6348 3.0157 3.3126 2.4814 2.0890 5.1023 3.3743 1.1930 6.7221 5.6263 3.4197 1.3834 3.6913 1.4716 2.7259 3.3373 1.5085 1.9160 4.4861 1.5268 2.6425 1.8993 1.3838 3.7070 1.3020 2.2265 2.9057 1.3138 1.8042 1.3104 1.6343 2.3996 1.9312 1.1374 1.7693 1.4369 2.9945 1.3860 1.3325 2.2135 1.3067 1.9203 1.2036 1.6149 1.3580 1.3702 1.6689 1.4933 1.4856 2.2383 2.8778 3.6809 1.0872 1.0860 1.0872 1.0971 3.3499 1.0941 5.0734 6.9119 7.4628 1.0822 1.0630 1.0634 1.0623 1.0609 1.0622 1.0975 1.0940 1.1033 1.1033 1.1024 1.0853 1.0905 1.0956 1.0992 1.0812
irintensity: 2.0047 0.1030 0.8840 0.5030 2.9321 0.0240 0.1773 5.2091 0.4701 1.0998 4.0040 0.6473 7.3131 0.7514 2.7246 0.9180 3.5088 76.3174 1.0412 8.8154 0.1016 108.2320 4.2763 0.0960 2.9855 8.6154 0.0670 4.0724 0.6380 12.5535 0.7167 0.1559 4.1211 8.6064 0.0523 1.3834 14.1553 0.0246 1.0697 0.1808 5.2521 0.0109 14.2126 3.6588 3.8031 1.0906 5.3239 7.8067 0.4148 49.3253 0.7062 10.3937 0.5524 7.2237 0.0060 0.2790 35.3969 0.4178 3.0873 25.2497 4.1200 46.3081 8.1955 1.5433 12.0279 21.5161 0.5068 3.6231 73.7143 0.6324 2.6784 25.7101 23.5782 59.2167 34.2328 37.3709 15.4096 77.8792 68.6464 31.8354 6.5134 89.2877 0.0449 13.6529 28.1373 21.5578 32.8820
temp: 298.150 k
press: 1.00000 atm
elementType: 7 7 6 6 6 6 6 6 6 6 6 6 6 6 6 1 1 1 1 1 1 1 1 1 1 1 1 1 1 1 1
symmnumber: 1
zpe: 692928.0 jmol-1
zpe.correction: 0.263922 hartree
zpe.thermalcorrener: 0.276265 hartree
zpe.thermalcorrenthalpy: 0.277209 hartree
zpe.thermalcorrgfe: 0.223844 hartree
zpe.sumelectzpe: -613.410930 hartree
zpe.sumelectthermal: -613.398588 hartree
zpe.sumelectthermalent: -613.397643 hartree
zpe.sumelectthermalfe: -613.451009 hartree
dipole: -1.0479 -3.3218 -0.0043
dipole: 3.4832
quadrupole: -82.8464 -81.9766 -93.3415
quadrupole: -1.0303 -0.0004 0.0169
quadrupole: 3.2085 4.0782 -7.2867 -1.0303 -0.0004 0.0169
hfenergy: -613.6748528 hartree
pointgroup: C01 [X(C13H16N2)]
dipole: 0.4177679 1.3051616 -0.0008256 debye
polarizability: 223.5375225|3.3898505|136.3297127|-0.0027201|-0.0214463|95.2446294 unknown
InChI: InChI=1S/C13H16N2/c1-2-6-10(7-3-1)13-14-11-8-4-5-9-12(11)15-13/h4-5,8-10,14H,1-3,6-7H2
charge 0 multiplicity 1
31 atoms
N  -0.667518 1.341044 -0.001063
N  -0.346672 -0.915732 0.000462
C  1.750626 0.510771 -0.000639
C  2.403352 -0.096015 -1.278046
C  2.402938 -0.092225 1.278786
C  3.9387 0.087548 -1.274698
C  3.938283 0.091332 1.275414
C  4.577021 -0.510307 0.001347
C  0.261439 0.284376 -0.000459
C  -1.956953 0.784597 -0.000581
C  -1.733859 -0.637191 0.000377
C  -3.247807 1.350039 -0.000874
C  -2.837508 -1.519767 0.001072
C  -4.335796 0.449207 -0.000183
C  -4.133323 -0.962036 0.000775
H  1.942443 1.607023 -0.002238
H  1.961264 0.368056 -2.181181
H  2.147335 -1.172461 -1.312593
H  2.146944 -1.168573 1.316413
H  1.960558 0.374498 2.180415
H  4.182529 1.169574 -1.332095
H  4.371589 -0.384837 -2.17789
H  4.370882 -0.378382 2.180142
H  4.182097 1.173518 1.329678
H  4.426345 -1.609641 0.002955
H  5.670416 -0.334188 0.001276
H  -0.435613 2.332849 -0.001793
H  -3.4123 2.432954 -0.001603
H  -2.677763 -2.602334 0.001795
H  -5.35846 0.842592 -0.000369
H  -5.006087 -1.62449 0.001297
