program: Gaussian 09
title: 000037585
version: EM64L-G09RevD.01
frameworkgroup: C1[X(C11H8N2O2)]
method: RPBEPBE
basis: SDD
operation: Freq
keyword: #p
keyword: freq=noraman
keyword: PBEPBE/SDD
title: #p freq=noraman PBEPBE/SDD
converged: YES YES NO NO
title: Mulliken charges:
elementType: O O N N C C C C C C C C C C C H H H H H H H H
charge: -0.279416 -0.433413 0.009469 0.002508 0.385022 -0.009686 0.210133 -0.340885 -0.323339 -0.243800 -0.352792 0.289854 -0.499228 -0.250313 -0.251053 0.258425 0.265020 0.243167 0.242958 0.371596 0.215987 0.254547 0.235239
chargesum: 0.00000
title: Mulliken charges with hydrogens summed into heavy atoms:
elementType: O O N N C C C C C C C C C C C
charge: -0.279416 -0.061817 0.009469 0.002508 0.385022 -0.009686 0.210133 -0.082460 -0.058320 -0.000634 -0.109834 0.289854 0.206546 -0.250313 -0.251053
polarizability: 2.51329045e+02 -1.21031759e+01 1.56745596e+02 4.10615797e+00 2.03547524e+00 6.48700182e+01
1716.lowfreq: -4.2065 -3.3162 -0.0003 -0.0001 0.0007 4.0786 29.0856 38.7489 62.2665
frequency: 29.0370 38.6876 62.2627 88.1708 125.1986 132.2562 163.8595 187.1478 217.9454 248.9889 258.5160 274.7754 316.0711 356.3230 372.7704 430.5297 437.9137 456.5297 521.2434 546.3567 570.5880 594.4106 598.1668 649.3673 713.6604 721.5157 767.9877 796.6709 809.9778 903.0836 908.3632 926.7689 973.5140 998.4359 1078.0238 1109.7302 1134.5500 1147.3040 1156.8672 1194.2142 1218.7506 1270.7352 1288.3313 1352.6051 1399.4734 1427.0560 1435.5724 1456.8555 1467.0003 1472.2456 1573.8899 1580.9287 1599.7341 2164.0059 2174.6193 2992.4316 3088.9728 3103.2396 3134.8535 3155.1707 3174.6877 3191.8722 3580.2548
redmass: 6.2611 3.3962 4.9951 7.3278 3.7620 5.2158 2.3881 2.4921 6.1371 3.3952 3.2424 3.0516 2.8956 2.7441 4.7739 6.2820 9.1229 7.8270 3.5299 5.9010 6.9861 7.8636 6.0133 6.2301 4.3095 3.4027 4.2461 1.9674 5.9253 1.3819 4.4555 1.6237 1.3417 3.3557 2.2546 1.2379 1.6949 1.7489 2.1267 1.4096 2.7219 1.7258 2.9959 2.2953 3.4688 2.8514 1.2800 1.0753 1.2661 1.7727 6.6166 5.6034 6.7792 12.6213 12.6361 1.0322 1.0879 1.1001 1.1058 1.0875 1.0938 1.0970 1.0661
irintensity: 1.6755 2.4634 5.7380 4.4825 2.6358 3.3427 2.6969 6.0563 4.3957 33.5142 19.2345 32.6142 27.0490 29.5467 8.5757 1.7711 5.7522 1.2759 2.0461 4.1126 5.9505 0.9115 1.7853 2.6923 15.4791 23.9800 17.7314 33.1299 23.2540 6.0868 31.5056 16.7716 0.4261 23.5705 22.7318 0.9117 98.6994 28.8041 70.1122 31.3210 187.3031 11.5650 222.5891 3.9450 30.8908 94.8180 13.3608 20.3349 76.1542 17.8504 205.4814 11.0816 28.2783 6.3978 53.5989 68.9860 7.2676 38.2593 19.1393 4.6006 3.3254 4.5885 27.3708
temp: 298.150 k
press: 1.00000 atm
elementType: 8 8 7 7 6 6 6 6 6 6 6 6 6 6 6 1 1 1 1 1 1 1 1
symmnumber: 1
zpe: 426594.7 jmol-1
zpe.correction: 0.162481 hartree
zpe.thermalcorrener: 0.176987 hartree
zpe.thermalcorrenthalpy: 0.177931 hartree
zpe.thermalcorrgfe: 0.119725 hartree
zpe.sumelectzpe: -682.793697 hartree
zpe.sumelectthermal: -682.779192 hartree
zpe.sumelectthermalent: -682.778247 hartree
zpe.sumelectthermalfe: -682.836454 hartree
dipole: -5.4725 -1.0990 0.7600
dipole: 5.6333
quadrupole: -109.5604 -85.5451 -88.6468
quadrupole: 3.5894 -5.9826 -7.2190
quadrupole: -14.9763 9.0390 5.9373 3.5894 -5.9826 -7.2190
hfenergy: -682.9561788 hartree
pointgroup: C01 [X(C11H8N2O2)]
dipole: -2.0298896 -0.8888136 0.0397007 debye
dipolederiv: -1.1333592 -0.7145468 -0.091216 -0.8175454 -0.9442397 -0.0843938 -0.3164941 -0.1670266 -0.3418607 -0.1599207 0.1568841 0.1890984 -0.1970295 -1.0769123 -0.2353397 0.0112097 -0.3383476 -0.4359091 -0.4055616 0.0311782 0.0348756 0.1449778 -0.226198 -0.0062996 0.1093296 0.0013633 -0.2258337 -0.2463294 -0.0086449 -0.0125011 -0.1349477 -0.2132441 0.000917 -0.149639 0.0091872 -0.2255746 -0.8384051 0.01855 0.0100807 0.4904667 -0.0686993 -0.0270315 0.2629792 -0.0385585 -0.0427849 0.1258025 -0.538738 -0.2056071 0.3456769 0.9259378 0.2909458 0.1477455 0.2997096 0.1099303 1.1654405 1.0714083 0.2279572 0.7694743 0.1854589 0.0479911 0.3640533 0.1297044 0.1138928 0.0868598 0.0342526 -0.0000988 -0.4416377 -0.1168968 0.0100798 -0.2785966 0.0029233 -0.111014 0.0674698 -0.0228955 0.0047804 -0.095209 -0.0244719 0.0695065 0.0056358 0.0535467 -0.1119236 -0.4020635 -0.1316213 -0.0474394 -0.0877498 0.0996976 0.0845572 0.0251404 0.101294 -0.1205287 1.3781999 0.0098153 0.0528894 -0.2299273 -0.0556729 0.0485195 -0.0448694 0.0504474 -0.0081919 -0.6593644 0.0471347 0.0103123 -0.2950146 0.1605839 0.0398743 -0.1849947 0.0491052 0.180395 0.3021582 0.0976297 -0.00584 0.5215122 0.789365 0.0012973 0.0255992 -0.011236 0.3119836 0.4148062 -0.1424056 -0.1386887 -0.2822136 0.0045312 -0.0262784 -0.2004554 -0.0292234 0.0035252 -0.0032001 0.0395528 0.0599876 0.2807164 0.094147 0.0466397 0.2646718 0.0231528 0.0943999 0.0364981 -0.0667962 -0.0017686 -0.0423937 0.0645125 -0.0342963 -0.0059951 -0.032645 0.139861 -0.0243921 0.0367352 0.0218432 0.0438223 0.1110805 -0.0215476 0.0044715 -0.0260054 0.1537309 0.064212 0.0131148 0.0075558 0.0403546 -0.055718 -0.0725547 0.0291917 -0.0759253 0.1382224 0.0835642 -0.0211199 -0.0177574 0.1115418 0.0098736 -0.0991161 -0.0415769 -0.0815561 0.0616684 0.1099223 0.0263962 -0.0713696 0.0635677 0.3903274 -0.0053966 -0.0706393 0.0358379 0.3315857 0.0885182 0.0650508 -0.1001167 -0.0886625 -0.0524066 0.0191697 -0.028598 0.1018816 -0.1168147 0.1183498 0.1028656 0.0867709 -0.0357819 -0.0382899 -0.0485544 0.0677408 -0.0656192 -0.018563 -0.1692053 -0.1038004 -0.0137479 -0.063998 0.0372342 0.001311 0.00409 0.0079897 0.1198037 unknown
polarizability: 252.5286533|6.6758909|138.0084409|-3.5910223|35.746244|82.4075648 unknown
InChI: InChI=1S/C11H8N2O2/c1-15-10-4-2-3-9(11(10)14)5-8(6-12)7-13/h2-5,14H,1H3
charge 0 multiplicity 1
23 atoms
O  -3.713127 -0.678741 -0.284897
O  -1.066258 -1.780528 -0.725605
N  4.642979 -0.809868 -1.077229
N  3.024862 2.208993 1.750812
C  -0.069981 0.392587 -0.025097
C  -1.205762 -0.461674 -0.252784
C  -2.530118 0.016952 -0.036546
C  -0.290373 1.714913 0.469587
C  -2.703732 1.344043 0.424267
C  -1.596579 2.183295 0.677759
C  1.246264 -0.103336 -0.405919
C  2.510352 0.327609 -0.020827
C  -3.791795 -2.146654 -0.123731
C  3.676488 -0.290942 -0.598787
C  2.77199 1.359355 0.946568
H  0.557677 2.380456 0.643525
H  -3.729862 1.687284 0.586764
H  -1.761401 3.203349 1.036739
H  1.266235 -0.920759 -1.142747
H  -0.179371 -2.159863 -0.508364
H  -3.379069 -2.457493 0.853358
H  -3.258486 -2.66527 -0.934454
H  -4.87033 -2.36211 -0.16289
