program: Gaussian 09
title: 000005756
version: EM64L-G09RevD.01
frameworkgroup: C1[X(C18H24O3)]
method: RPBEPBE
basis: SDD
operation: Freq
keyword: #pfreq=noraman
keyword: PBEPBE/SDD
title: #p freq=noraman PBEPBE/SDD
converged: YES YES NO NO
title: Mulliken charges:
elementType: O O O C C C C C C C C C C C C C C C C C C H H H H H H H H H H H H H H H H H H H H H H H H
charge: -0.446523 -0.435991 -0.438356 0.406123 -0.157338 -0.113759 -0.166282 -0.196704 -0.521219 -0.614303 -0.174068 -0.487586 -0.507365 -0.822464 0.252322 -0.578960 0.301978 -0.344203 -0.538843 -0.446903 0.287179 0.216793 0.248844 0.203936 0.188897 0.193471 0.228642 0.244408 0.224784 0.264407 0.224718 0.192397 0.222913 0.214534 0.221654 0.217494 0.262051 0.223968 0.227845 0.350758 0.322238 0.222858 0.255306 0.217982 0.352368
chargesum: 0.00000
title: Mulliken charges with hydrogens summed into heavy atoms:
elementType: O O O C C C C C C C C C C C C C C C C C C
charge: -0.095765 -0.113753 -0.085988 0.406123 0.059455 0.135085 0.037654 -0.007807 -0.099106 -0.145112 0.090339 -0.070470 -0.069918 -0.121265 0.252322 -0.127147 0.301978 -0.121345 -0.283537 -0.228921 0.287179
polarizability: 2.63799414e+02 -5.80015796e+00 1.89402584e+02 5.40828755e+00 6.07377599e+00 1.33768514e+02
1716.lowfreq: -20.7363 -4.1802 -0.0005 -0.0004 0.0005 10.7359 29.3341 54.0625 71.6260
frequency: 28.6596 53.8308 71.6020 97.7574 109.3541 151.1315 174.0210 195.5897 210.9781 219.7553 225.5449 243.9623 271.4993 275.6873 302.0290 320.7855 335.9869 343.1216 351.7164 359.9301 377.6536 391.1000 422.9990 437.7994 442.1745 457.3957 480.8980 487.6277 510.2613 520.8001 553.2750 565.0853 615.9061 625.4557 645.1301 707.9164 722.4885 750.2711 775.5276 806.2636 825.2260 833.7547 846.7658 862.4100 887.7730 905.6593 921.6701 927.3798 936.7713 957.0001 974.7489 992.2109 1008.3977 1016.6628 1022.8629 1036.9003 1047.8226 1067.2213 1075.0233 1093.4865 1102.8566 1119.9842 1129.6057 1138.1811 1143.8144 1152.5102 1168.5357 1176.9260 1179.4127 1184.0227 1198.3875 1213.6817 1227.4161 1238.5216 1244.1106 1254.3703 1257.4076 1267.0237 1277.7978 1283.2821 1286.9761 1304.3759 1316.4574 1324.1174 1329.7766 1334.7827 1337.9929 1343.6341 1354.0955 1369.7920 1380.2930 1383.3967 1388.3164 1396.0644 1441.8500 1458.0723 1460.2506 1466.4319 1469.7023 1470.7224 1482.2818 1492.7270 1494.7388 1586.5185 1631.1537 2884.6865 2896.1554 2907.4670 2958.8595 2959.6654 2960.5416 2971.4543 2985.5740 2993.2155 2997.0352 3020.2958 3031.7361 3032.8031 3042.6064 3049.2525 3067.4224 3080.6901 3094.2211 3111.3576 3141.1808 3151.1347 3542.7119 3561.1157 3582.5044
redmass: 4.9532 4.1635 3.5846 4.3591 5.2319 1.8655 1.8126 2.5355 2.8437 4.0532 2.8984 3.2025 3.5293 2.3457 1.3547 3.0226 2.9811 1.1219 2.8332 1.8928 1.4684 3.7369 3.3150 3.6247 2.8867 3.5733 2.9178 3.1654 3.0048 3.5927 3.7315 3.4033 3.9586 2.9627 2.7572 3.9428 4.4084 2.9717 1.9914 1.8160 1.9559 2.6383 1.9708 2.2689 1.6550 2.6321 2.1193 1.5310 1.6624 2.1946 1.8636 2.1063 3.2677 2.2609 2.4926 2.7124 2.6747 2.3685 2.5744 1.8676 2.1438 1.7996 1.4174 1.8208 1.4385 1.4777 1.7102 1.5288 1.4327 1.5204 1.5864 1.7906 1.4188 1.3678 1.5536 1.7606 2.1156 1.5305 1.4428 1.4288 1.3476 1.4008 1.3974 1.5220 1.5572 1.5441 1.3457 1.4620 1.4894 1.5398 1.8031 2.4562 1.2947 1.2538 2.9586 1.1666 1.0840 1.0883 1.0925 1.0810 1.0690 1.0604 2.7026 7.1661 6.4603 1.0825 1.0802 1.0801 1.0649 1.0688 1.0674 1.0726 1.0593 1.0402 1.0590 1.0936 1.0958 1.1017 1.1021 1.0995 1.0907 1.0973 1.0993 1.0891 1.0915 1.0934 1.0659 1.0658 1.0660
irintensity: 0.1390 0.9518 1.9303 0.7578 0.9186 0.5060 0.2198 5.0232 4.1285 2.8502 1.7834 1.4234 1.8800 3.3120 57.2657 9.3154 8.6063 137.2797 6.3469 43.2046 137.8616 5.7686 0.9910 17.6579 5.4755 0.2594 6.4498 5.0473 0.4733 0.3930 3.7631 13.0538 1.9654 3.2823 5.5773 2.1874 3.8779 10.5883 18.7048 19.6545 5.8456 22.0162 6.7364 2.8126 31.3210 61.9594 1.3826 0.5913 21.1955 5.5325 6.1788 8.8497 90.7544 20.5030 17.3862 42.2549 0.7513 4.2791 30.5128 43.9417 18.6184 14.2240 61.4952 10.0921 32.6086 49.9533 10.1102 37.3937 1.2110 26.1067 30.7146 8.1535 6.8575 11.6835 3.7290 14.8834 11.3906 0.5057 21.1288 14.9143 7.4635 1.3829 2.4813 5.2343 7.9235 1.6833 0.1844 0.5807 5.4953 3.5878 4.9092 26.2012 14.5894 27.5689 6.2705 7.3749 2.7901 14.8556 10.0646 3.7497 5.3563 11.2341 96.4873 29.9950 50.0580 33.6715 8.5841 47.8434 29.8435 16.9098 25.0251 51.3780 26.2255 24.1793 20.9659 38.5320 30.7340 49.3935 56.4052 12.5293 38.5771 34.9490 17.2209 21.1750 11.4494 14.2224 7.0054 8.1931 37.8408
temp: 298.150 k
press: 1.00000 atm
elementType: 8 8 8 6 6 6 6 6 6 6 6 6 6 6 6 6 6 6 6 6 6 1 1 1 1 1 1 1 1 1 1 1 1 1 1 1 1 1 1 1 1 1 1 1 1
symmnumber: 1
zpe: 1005848.7 jmol-1
zpe.correction: 0.383108 hartree
zpe.thermalcorrener: 0.402310 hartree
zpe.thermalcorrenthalpy: 0.403254 hartree
zpe.thermalcorrgfe: 0.337123 hartree
zpe.sumelectzpe: -924.389212 hartree
zpe.sumelectthermal: -924.370010 hartree
zpe.sumelectthermalent: -924.369065 hartree
zpe.sumelectthermalfe: -924.435196 hartree
dipole: 0.9245 -0.4640 -1.6465
dipole: 1.9445
quadrupole: -135.4452 -124.2377 -124.0655
quadrupole: -11.0634 3.9138 1.3287
quadrupole: -7.5291 3.6785 3.8506 -11.0634 3.9138 1.3287
hfenergy: -924.7723193 hartree
pointgroup: C01 [X(C18H24O3)]
dipole: 0.3655046 0.1754667 0.6487354 debye
polarizability: 263.7322119|6.0738739|189.2739242|-5.7917559|6.7240026|133.964375 unknown
InChI: InChI=1S/C18H24O3/c1-18-7-6-13-12-5-3-11(19)8-10(12)2-4-14(13)15(18)9-16(20)17(18)21/h3,5,8,13-17,19-21H,2,4,6-7,9H2,1H3
charge 0 multiplicity 1
45 atoms
O  -4.76971 1.580774 -0.245774
O  -5.227615 -1.487978 0.656062
O  6.214851 -0.059383 -0.323609
C  -2.386618 0.806429 -0.194684
C  -1.769926 -0.556363 0.271263
C  -0.291768 -0.689457 -0.127649
C  0.507839 0.464225 0.557693
C  -3.843918 0.582386 0.28042
C  -1.618924 1.95089 0.505334
C  -2.800929 -1.624524 -0.18878
C  -4.173803 -0.871992 -0.171026
C  -0.092099 1.864254 0.231383
C  0.336549 -2.043208 0.265569
C  -2.372647 1.007534 -1.734353
C  2.016279 0.348015 0.279152
C  1.761842 -2.15696 -0.309762
C  2.604544 -0.901938 -0.088505
C  2.8766 1.464041 0.437973
C  4.001938 -0.996187 -0.280157
C  4.271119 1.374107 0.246146
C  4.833569 0.128824 -0.115835
H  -1.791612 -0.5386 1.386929
H  -0.205634 -0.582646 -1.23046
H  0.365504 0.310847 1.654251
H  -3.861406 0.606469 1.398253
H  -1.795768 1.88787 1.600135
H  -2.00316 2.934737 0.174834
H  -2.572636 -1.993816 -1.205655
H  -2.828339 -2.509585 0.472974
H  -4.636942 -0.84558 -1.171499
H  0.126977 2.116486 -0.824512
H  0.407541 2.639159 0.843035
H  -0.2810 -2.882929 -0.106854
H  0.363124 -2.123678 1.372198
H  -1.359623 1.224409 -2.112607
H  -2.746801 0.123032 -2.280591
H  -3.028402 1.856906 -1.990864
H  1.692429 -2.34544 -1.401718
H  2.284749 -3.033346 0.118904
H  -5.691055 1.302601 -0.010316
H  -4.87734 -1.61255 1.57552
H  2.458101 2.434778 0.721663
H  4.461912 -1.950906 -0.558356
H  4.90602 2.259972 0.378873
H  6.706891 0.786824 -0.181199
