program: Gaussian 09
title: 000005858
version: EM64L-G09RevD.01
frameworkgroup: C1[X(C20H30O2)]
method: RPBEPBE
basis: SDD
operation: Freq
keyword: #pfreq=noraman
keyword: PBEPBE/SDD
title: #p freq=noraman PBEPBE/SDD
converged: YES YES NO NO
title: Mulliken charges:
elementType: O O C C C C C C C C C C C C C C C C C C C C H H H H H H H H H H H H H H H H H H H H H H H H H H H H H H
charge: -0.468570 -0.237067 0.408453 -0.161066 -0.136306 -0.068600 0.258910 -0.549608 -0.562862 -0.529224 -0.518130 -0.242810 -0.489897 -0.818119 -0.487460 -0.637953 0.535643 -0.464920 -0.543690 -0.729869 -0.578709 0.179863 0.221496 0.236440 0.220893 0.209355 0.225163 0.216876 0.226530 0.213293 0.222101 0.230202 0.203954 0.232432 0.226385 0.218105 0.205757 0.227827 0.256754 0.237803 0.208252 0.218793 0.236073 0.213956 0.224220 0.328386 0.242592 0.224886 0.202709 0.221069 0.233333 0.256351
chargesum: 0.00000
title: Mulliken charges with hydrogens summed into heavy atoms:
elementType: O O C C C C C C C C C C C C C C C C C C C C
charge: -0.140183 -0.237067 0.408453 0.060430 0.100134 0.152294 0.258910 -0.115090 -0.119456 -0.093830 -0.083973 -0.010379 -0.045407 -0.127781 -0.041404 -0.183087 0.535643 -0.026744 -0.076213 -0.072757 -0.322358 0.179863
polarizability: 2.85462904e+02 6.66442831e+00 1.93474767e+02 -9.49759400e+00 1.31163313e+00 1.68165749e+02
1716.lowfreq: -11.9485 -0.0006 -0.0005 -0.0004 6.5885 9.8799 33.2704 52.5805 71.2944
frequency: 32.3146 52.4317 71.2621 91.4108 95.2168 119.1976 146.6275 163.6187 179.1550 197.2944 212.6267 216.1222 229.9307 244.6506 251.7975 272.5088 288.2883 306.0641 320.2275 336.5773 339.4115 360.8788 377.8593 391.6210 399.4561 424.5385 447.6491 453.8901 469.8058 479.9458 512.0747 523.4808 553.2168 558.5761 598.2221 611.4788 637.5658 679.4568 703.7646 756.0224 770.4639 790.4052 807.1923 814.6241 830.0377 848.2272 863.8300 869.5072 898.6605 914.7689 929.1224 945.0108 951.5852 961.2587 968.3045 983.4886 995.9311 1004.8057 1011.5599 1015.2333 1026.0922 1043.8446 1058.9138 1062.8157 1072.8045 1082.9854 1094.6845 1109.2182 1113.0126 1127.3530 1142.2417 1144.1697 1154.6304 1161.0483 1168.1898 1182.2624 1189.4307 1201.7921 1211.9184 1221.5820 1229.6799 1239.9051 1242.9912 1251.6305 1266.4825 1276.5254 1281.2029 1283.9672 1289.8994 1293.1452 1301.8740 1309.5766 1318.3679 1321.0069 1322.8073 1331.3873 1333.6459 1343.2094 1346.5661 1351.1058 1354.3007 1360.3504 1370.5916 1390.3082 1393.2827 1442.8300 1452.1692 1453.7279 1459.2039 1467.0193 1467.3124 1468.4443 1472.4463 1476.2737 1479.9932 1487.2072 1492.3614 1493.9764 1586.1972 1628.8239 2899.1982 2921.4656 2924.5240 2942.6042 2952.4829 2969.4160 2969.9170 2972.0463 2975.6615 2978.2837 2978.9912 2987.1156 2989.3588 3002.0679 3009.8604 3031.2537 3034.2419 3038.7617 3040.1546 3043.3065 3045.2286 3050.1234 3064.0894 3064.4283 3071.0846 3077.8806 3088.6869 3102.4654 3119.1208 3561.5470
redmass: 5.7394 3.3939 3.7403 1.8289 2.5466 3.7022 2.6936 2.4901 3.1704 2.4874 2.8950 1.4287 1.4226 1.7899 2.1512 1.4893 2.5535 2.1777 2.4977 3.2648 2.8320 2.5683 3.2337 3.0673 2.9958 3.3846 3.3915 3.6952 4.1432 2.4456 3.7619 2.4923 2.7741 2.9275 2.8757 3.5458 3.1174 2.9893 2.7681 2.2467 1.5261 1.4349 2.2109 2.2027 1.9131 1.9939 2.4275 2.2625 1.4224 1.7827 1.7919 1.8508 2.3245 2.0760 2.1179 2.1787 2.3434 1.9276 1.8859 2.2224 2.5275 2.1746 1.8212 2.1994 2.0771 1.9585 2.5065 1.7917 1.5906 2.0767 1.8400 1.9648 1.9416 1.8840 1.8250 1.6666 1.6730 1.4878 1.5448 1.4876 1.3887 1.4630 1.6353 1.4565 1.6160 1.3355 1.4194 1.3663 1.4067 1.5261 1.3612 1.4387 1.4061 1.4808 1.3728 1.5110 1.3896 1.4716 1.6552 1.5836 1.7946 1.5154 1.4883 1.1965 1.2090 1.0831 1.0751 1.0899 1.0693 1.0888 1.0785 1.0875 1.0796 1.0788 1.0555 1.0731 1.0532 1.0579 9.8979 7.7339 1.0784 1.0831 1.0785 1.0668 1.0816 1.0641 1.0666 1.0378 1.0594 1.0619 1.0624 1.0603 1.0606 1.0371 1.0614 1.0979 1.0965 1.0975 1.0992 1.1004 1.1015 1.0978 1.0994 1.0953 1.1030 1.0994 1.0981 1.0985 1.0913 1.0655
irintensity: 2.4837 1.8752 0.8226 0.7371 0.3919 0.1153 0.6488 1.9230 1.2121 1.8349 0.2510 6.7769 11.2318 26.0793 8.4315 67.3356 2.0915 1.4204 2.3891 7.9509 7.4298 1.8089 0.8026 4.4008 2.3067 0.9660 3.5954 8.8982 3.7053 0.5549 0.8507 3.1411 0.5690 2.6234 0.2220 1.9687 1.8979 3.6709 2.9176 6.7892 1.4879 3.3689 1.4074 1.1221 0.8492 16.2756 7.1369 1.4780 23.4865 6.7093 4.0453 52.9492 32.9381 3.1109 15.4302 10.4935 5.3896 1.7810 9.0560 1.5318 0.9306 6.9363 1.2563 11.1324 6.9261 3.9485 5.2095 16.6049 4.1276 5.3446 2.6961 8.2286 3.6075 0.5301 2.5886 4.9030 16.5244 22.4838 21.6370 2.2395 5.5626 12.7261 0.9453 5.3255 51.1637 2.6913 1.8009 4.1314 1.6878 6.3086 0.2638 4.3869 1.9583 11.5397 4.6078 2.0288 5.3306 1.8576 3.0456 7.0875 8.0841 4.1148 1.0269 31.6878 16.7172 14.3140 6.5097 14.7101 3.3956 6.3924 5.7550 9.2177 7.2199 5.0068 10.1059 6.1512 7.7825 13.4433 171.6878 204.6121 5.9262 4.2678 14.8817 15.8085 24.3052 45.5950 2.9113 48.7798 50.6122 23.7776 22.3924 26.2852 34.1859 30.8354 39.8130 24.4490 46.8119 19.1361 24.5592 57.7993 24.0795 26.9129 25.6469 21.6155 75.5258 44.2487 39.2170 17.4479 10.7152 1.2872
temp: 298.150 k
press: 1.00000 atm
elementType: 8 8 6 6 6 6 6 6 6 6 6 6 6 6 6 6 6 6 6 6 6 6 1 1 1 1 1 1 1 1 1 1 1 1 1 1 1 1 1 1 1 1 1 1 1 1 1 1 1 1 1 1
symmnumber: 1
zpe: 1201567.5 jmol-1
zpe.correction: 0.457653 hartree
zpe.thermalcorrener: 0.478696 hartree
zpe.thermalcorrenthalpy: 0.479640 hartree
zpe.thermalcorrgfe: 0.409802 hartree
zpe.sumelectzpe: -928.863170 hartree
zpe.sumelectthermal: -928.842127 hartree
zpe.sumelectthermalent: -928.841183 hartree
zpe.sumelectthermalfe: -928.911021 hartree
dipole: 5.6115 0.9465 -0.4556
dipole: 5.7090
quadrupole: -172.1989 -130.3931 -135.5923
quadrupole: 2.8365 18.4379 -1.3617
quadrupole: -26.1375 15.6684 10.4691 2.8365 18.4379 -1.3617
hfenergy: -929.3208229 hartree
pointgroup: C01 [X(C20H30O2)]
dipole: -2.2058456 -0.3820164 -0.1821299 debye
polarizability: 285.4554307|6.9943035|193.6362951|9.1688564|-0.3385903|168.0116948 unknown
InChI: InChI=1S/C20H30O2/c1-3-20(22)11-9-18-17-6-4-13-12-14(21)5-7-15(13)16(17)8-10-19(18,20)2/h12,15-18,22H,3-11H2,1-2H3
charge 0 multiplicity 1
52 atoms
O  -4.662071 0.922561 -0.789775
O  6.222676 0.239749 1.003794
C  -2.254184 0.434199 -0.514294
C  -1.484124 -0.806805 0.037908
C  -0.023245 -0.879552 -0.449917
C  0.725125 0.41781 -0.010532
C  -3.704687 0.164515 0.049836
C  -1.525004 1.710005 -0.026307
C  -2.429821 -1.999779 -0.254414
C  -0.029939 1.704059 -0.450256
C  -3.86852 -1.392559 -0.134899
C  2.217842 0.430343 -0.497376
C  0.712926 -2.12373 0.091501
C  -2.33445 0.439922 -2.067804
C  -3.896324 0.607147 1.529039
C  2.176495 -2.16264 -0.410271
C  2.929696 -0.87433 -0.136603
C  2.977094 1.668942 0.049409
C  4.506271 1.574062 -0.132573
C  -5.31632 0.381111 2.099612
C  4.203896 -0.901846 0.371977
C  5.065306 0.292207 0.484189
H  -1.430408 -0.689042 1.144192
H  -0.01552 -0.937848 -1.560441
H  0.749134 0.40632 1.10424
H  -1.563511 1.768114 1.079384
H  -2.023363 2.617925 -0.418198
H  -2.274721 -2.836406 0.449833
H  -2.250141 -2.394116 -1.272919
H  0.056711 1.819394 -1.549519
H  0.458875 2.591376 -0.006458
H  -4.455747 -1.5797 -1.052017
H  -4.422816 -1.844487 0.707204
H  2.189039 0.491706 -1.611651
H  0.192677 -3.047079 -0.226669
H  0.697569 -2.10742 1.200981
H  -1.335906 0.496933 -2.533582
H  -2.837569 -0.460839 -2.459017
H  -2.924952 1.308639 -2.401117
H  -3.664383 1.685995 1.601112
H  -3.166079 0.073303 2.167687
H  2.153782 -2.319812 -1.511412
H  2.722199 -3.021895 0.020927
H  2.749307 1.770525 1.130431
H  2.607614 2.585184 -0.444669
H  -5.575457 0.763921 -0.44175
H  5.026623 2.440744 0.311555
H  4.758982 1.562979 -1.2139
H  -6.073992 1.00019 1.580454
H  -5.633895 -0.675898 2.037548
H  -5.349884 0.673915 3.16442
H  4.665795 -1.852913 0.66831
