program: Gaussian 09
title: 000037556
version: EM64L-G09RevD.01
frameworkgroup: C1[X(C13H13N3O)]
method: RPBEPBE
basis: SDD
operation: Freq
keyword: #p
keyword: freq=noraman
keyword: PBEPBE/SDD
title: #p freq=noraman PBEPBE/SDD
converged: YES YES NO NO
title: Mulliken charges:
elementType: O N N N C C C C C C C C C C C C C H H H H H H H H H H H H H
charge: -0.267289 -0.482708 -0.010455 -0.685309 0.366435 0.266167 0.256431 0.138693 -0.278496 -0.332200 -0.323473 -0.844944 0.505812 -0.475681 -0.415426 -0.433263 -0.354629 0.334325 0.304994 0.272173 0.200932 0.227665 0.231654 0.247325 0.241109 0.224063 0.221497 0.238884 0.311904 0.313808
chargesum: 0.00000
title: Mulliken charges with hydrogens summed into heavy atoms:
elementType: O N N N C C C C C C C C C C C C C
charge: -0.267289 -0.148383 -0.010455 -0.059597 0.366435 0.266167 0.256431 0.138693 0.026498 -0.060027 -0.122541 -0.138301 0.505812 -0.234571 -0.191363 -0.211766 -0.115744
polarizability: 3.03440399e+02 -1.05816225e+01 1.70693024e+02 -3.91332287e+00 -3.92187638e+00 7.33054829e+01
1716.lowfreq: -8.0143 -2.5807 -0.0008 -0.0006 0.0001 4.6748 26.3291 36.8261 65.2505
frequency: 26.2918 36.8238 65.2461 90.2181 113.9197 170.6565 192.2489 201.3041 221.1331 263.5761 296.5417 313.1840 371.2952 404.9973 408.8300 412.1268 414.8940 424.7243 437.5395 506.7187 539.5031 562.7050 582.1066 626.6276 633.4892 637.2778 685.7988 752.1511 757.6803 768.4443 809.1060 818.5142 837.6070 845.4849 857.5777 867.4002 917.2155 936.2584 983.7796 984.7547 989.6968 997.4448 1020.8090 1035.6826 1043.9484 1079.8295 1136.0214 1168.5830 1192.8055 1194.2468 1254.1902 1281.9896 1305.6974 1316.0921 1328.8718 1332.8823 1385.7035 1397.9499 1405.5343 1436.5088 1450.1510 1478.0130 1479.5168 1491.1384 1520.2287 1560.7423 1568.9164 1590.7693 1607.1043 1633.0195 1647.4230 2953.5082 3023.5834 3083.4171 3104.3790 3111.5104 3126.6505 3136.5597 3136.8858 3162.2003 3204.4187 3548.8458 3561.2692 3700.7252
redmass: 3.8422 5.2885 4.9588 5.8128 5.0034 3.3490 1.1926 3.5791 4.7429 4.0089 5.2121 5.0875 3.5167 1.0776 2.5017 3.5005 1.2648 2.7687 5.0833 2.9206 5.0911 2.6588 6.4390 1.6450 6.6402 3.9367 3.7701 4.0533 4.4608 5.4727 1.4774 4.6687 3.2110 2.0768 1.3386 6.6868 1.3422 1.4019 1.3724 1.3767 1.5384 2.8406 1.4399 2.3767 1.5282 3.8780 1.2323 2.5600 1.4180 1.3689 3.1405 2.3172 1.7444 1.7254 2.7870 2.5280 4.2843 1.2823 2.1812 2.2321 2.8934 1.6373 1.0511 1.7469 3.1041 6.8894 4.9946 5.2097 4.4919 3.0629 1.4589 1.0394 1.0981 1.0950 1.0873 1.0910 1.0895 1.0953 1.0918 1.0952 1.0949 1.0751 1.0451 1.1040
irintensity: 0.0354 0.5517 1.5966 5.4302 2.7486 1.0051 0.6066 3.0484 0.2231 4.1099 2.9019 5.0716 4.5982 7.1022 9.6701 0.4539 287.8538 11.1785 10.6487 5.9245 11.9672 35.9238 23.0991 27.3976 2.1425 2.9687 28.7889 0.9961 22.6175 4.8447 17.3870 1.7975 15.1470 38.8992 54.3080 7.4657 0.1569 0.8643 2.2627 3.5755 8.5476 4.0392 2.3815 20.3148 6.9565 39.4912 37.5097 12.9934 80.9053 91.7274 251.9208 6.2480 100.8913 147.5111 83.0741 4.9067 0.4585 28.2331 8.5566 173.9989 67.4316 153.2761 17.6643 314.4961 25.1249 65.2820 272.2737 39.0319 250.1223 67.7190 334.9165 29.3089 22.6140 18.2330 23.1405 35.8152 20.4985 24.3496 18.8987 6.2638 7.7777 11.6411 129.4956 24.2030
temp: 298.150 k
press: 1.00000 atm
elementType: 8 7 7 7 6 6 6 6 6 6 6 6 6 6 6 6 6 1 1 1 1 1 1 1 1 1 1 1 1 1
symmnumber: 1
zpe: 621826.2 jmol-1
zpe.correction: 0.236841 hartree
zpe.thermalcorrener: 0.251937 hartree
zpe.thermalcorrenthalpy: 0.252881 hartree
zpe.thermalcorrgfe: 0.193669 hartree
zpe.sumelectzpe: -741.485403 hartree
zpe.sumelectthermal: -741.470308 hartree
zpe.sumelectthermalent: -741.469363 hartree
zpe.sumelectthermalfe: -741.528575 hartree
dipole: -8.0900 4.8373 0.3489
dipole: 9.4324
quadrupole: -86.2908 -91.4226 -105.0076
quadrupole: -0.3504 0.1151 -1.8787
quadrupole: 7.9495 2.8178 -10.7673 -0.3504 0.1151 -1.8787
hfenergy: -741.7222443 hartree
pointgroup: C01[X(C13H13N3O1)]
dipole: 3.1669007 -1.9324258 0.0884648 debye
polarizability: 303.2351921|-11.8012458|170.5538988|4.260335|6.7772017|73.6498153 unknown
InChI: InChI=1S/C13H13N3O/c1-9-8-15-7-6-12(9)16-13(17)10-2-4-11(14)5-3-10/h2-8,16H,14H2,1H3
charge 0 multiplicity 1
30 atoms
O  -0.011952 2.109861 0.042828
N  -0.732535 -0.126966 0.081864
N  -4.990179 0.21139 -0.0729
N  5.764568 -0.799741 0.001573
C  -2.137439 0.026419 0.033211
C  -2.944391 -1.155337 0.101721
C  1.670648 0.366967 0.018995
C  0.261421 0.869115 0.041916
C  -2.783231 1.286568 -0.084233
C  2.699837 1.292385 0.345228
C  2.053713 -0.956305 -0.336881
C  -2.336753 -2.539433 0.228861
C  4.427899 -0.418274 0.003204
C  -4.346236 -0.987817 0.043436
C  4.049045 0.915792 0.345636
C  3.402745 -1.347616 -0.347123
C  -4.191847 1.319015 -0.134194
H  -0.399658 -1.085591 0.192733
H  -2.192346 2.201632 -0.128509
H  2.404108 2.3168 0.59429
H  1.308198 -1.695449 -0.658082
H  -1.691415 -2.794098 -0.636501
H  -1.729595 -2.648118 1.150298
H  -3.129781 -3.304525 0.274646
H  -4.994972 -1.871867 0.092552
H  4.822306 1.647773 0.608013
H  3.673697 -2.36919 -0.639476
H  -4.712913 2.27867 -0.226386
H  6.038875 -1.746145 -0.24638
H  6.496084 -0.134716 0.236462
