program: Gaussian 09
title: 000005729
version: EM64L-G09RevD.01
frameworkgroup: C1[X(C10H10F3NO2)]
method: RPBEPBE
basis: SDD
operation: Freq
keyword: #p
keyword: freq=noraman
keyword: PBEPBE/SDD
title: #p freq=noraman PBEPBE/SDD
converged: NO YES NO NO
title: Mulliken charges:
elementType: F F F O O N C C C C C C C C C C H H H H H H H H H H
charge: -0.199904 -0.138720 -0.134817 -0.443488 -0.276866 -0.431150 0.015810 0.131456 0.410133 -0.681480 0.498488 -0.447010 -0.339277 -0.195507 -0.213814 -0.247147 0.270345 0.211989 0.249758 0.338152 0.388597 0.227983 0.307281 0.232519 0.232261 0.234410
chargesum: 0.00000
title: Mulliken charges with hydrogens summed into heavy atoms:
elementType: F F F O O N C C C C C C C C C C
charge: -0.199904 -0.138720 -0.134817 -0.054891 -0.276866 -0.092998 0.015810 0.131456 0.410133 0.050612 0.498488 -0.219028 -0.031996 0.037012 0.018446 -0.012737
polarizability: 1.78978286e+02 -1.19826640e+01 1.20584469e+02 -9.07984200e+00 -1.40933955e+01 7.41495601e+01
1716.lowfreq: -4.3310 -0.0005 0.0006 0.0008 2.5756 5.7865 33.8380 42.3401 74.8456
frequency: 33.7328 42.3317 74.8157 88.0098 104.2529 154.6953 202.0003 206.2008 214.6942 240.2864 283.5672 302.5039 319.2130 352.0816 380.5888 407.1000 415.1804 454.9414 499.7155 511.6116 519.7888 542.9300 590.4447 614.3224 634.5739 687.3952 697.9282 705.5300 773.8587 775.2080 819.9035 845.9807 886.2583 923.5211 925.0819 965.9188 978.2980 986.2288 1002.6490 1027.0454 1055.9115 1069.4159 1091.3792 1105.5856 1131.2666 1175.1760 1185.7840 1192.9079 1215.9163 1262.0230 1326.5288 1365.1867 1388.5736 1396.9228 1437.5189 1457.5156 1473.3080 1484.8666 1538.4507 1608.4211 1613.9522 1625.1896 3006.6538 3109.2095 3116.3428 3121.2365 3137.7721 3150.4960 3169.7234 3197.6651 3323.9604 3501.0309
redmass: 4.7635 7.1605 8.7000 7.4440 6.0373 6.0854 3.2723 1.4026 2.8883 7.2503 4.3376 6.4263 5.3213 7.2690 6.7634 2.9127 8.7340 7.9292 4.2679 3.5170 2.9117 1.6362 6.5731 6.4838 9.6210 1.5049 2.1183 2.9983 2.3235 2.4692 4.9949 1.2657 4.3167 1.6925 1.9612 8.0951 1.3692 6.1732 1.3143 2.2028 5.2967 3.3528 1.6005 2.9669 2.8952 1.0682 2.9325 1.2272 4.6646 2.1343 1.4117 1.5034 4.7287 1.3151 2.2377 1.0774 1.0565 2.3451 2.0089 4.3462 5.7007 6.4500 1.0356 1.1001 1.0892 1.1013 1.0870 1.0935 1.0999 1.0953 1.0638 1.0767
irintensity: 0.2414 0.3000 0.3133 1.4797 0.2048 3.4618 1.0713 1.7037 2.6347 0.7635 3.1527 4.7900 4.4397 2.3802 46.8464 0.0429 4.0702 13.2644 21.0879 48.3495 11.7465 50.2998 12.2591 0.6372 6.0554 7.3695 54.8577 27.4961 46.9928 80.0217 2.8975 0.5415 26.7190 6.4946 17.5704 156.7345 1.2973 0.9879 2.0218 4.6037 172.4921 255.5337 6.6921 135.1981 47.1515 2.1810 53.7457 16.4919 64.2586 13.9437 51.4823 234.3654 2.1294 20.1622 27.2471 6.5454 26.7712 50.7582 209.2665 52.3998 43.7445 152.6662 7.8176 13.5612 10.7993 7.9253 0.6682 23.9845 20.3644 5.2160 118.9237 45.5911
temp: 298.150 k
press: 1.00000 atm
elementType: 9 9 9 8 8 7 6 6 6 6 6 6 6 6 6 6 1 1 1 1 1 1 1 1 1 1
symmnumber: 1
zpe: 491822.4 jmol-1
zpe.correction: 0.187325 hartree
zpe.thermalcorrener: 0.202313 hartree
zpe.thermalcorrenthalpy: 0.203257 hartree
zpe.thermalcorrgfe: 0.144576 hartree
zpe.sumelectzpe: -890.621504 hartree
zpe.sumelectthermal: -890.606516 hartree
zpe.sumelectthermalent: -890.605572 hartree
zpe.sumelectthermalfe: -890.664253 hartree
dipole: 3.6490 -1.6838 2.4038
dipole: 4.6828
quadrupole: -92.1865 -91.3803 -93.2335
quadrupole: -1.0181 -4.8054 -3.2938
quadrupole: 0.0803 0.8865 -0.9667 -1.0181 -4.8054 -3.2938
hfenergy: -890.8088296 hartree
pointgroup: C01 [X(C10H10F3N1O2)]
dipole: 1.4771487 0.672993 -0.8714391 debye
dipolederiv: -0.5720098 -0.1147564 0.0880358 -0.2023903 -0.7159921 0.0672044 0.1081965 -0.0140739 -0.356573 -0.3358267 0.04734 -0.0077034 0.0747066 -0.2981277 -0.0059837 0.0097175 0.0606837 -0.8478177 -0.951933 0.1441397 -0.0939598 0.2942128 -0.3224447 -0.0026688 0.025431 -0.0417963 -0.3149005 -0.5524015 -0.1916769 0.102483 -0.0098798 -0.6146626 0.0490199 0.0496886 0.0122965 -0.5398649 -0.6645752 0.0948612 -0.080053 -0.5996049 -0.9512797 0.0871591 0.1145277 0.1703906 -0.3344022 -1.4185365 -0.3487446 -0.0803454 -0.5027663 -0.513427 -0.0056791 -0.0276351 0.0345618 -0.2750624 0.0573981 0.1757014 -0.0640713 0.2704078 0.3416517 -0.0417913 -0.0922521 -0.0300816 0.3150313 1.1903387 0.070659 0.1483683 0.937327 1.1614121 -0.1495075 -0.0630895 -0.265195 0.1590347 1.6626019 -0.0625998 -0.0079589 -0.2528141 1.2330627 -0.0193977 -0.2245239 -0.0200019 1.3958766 -0.1260081 0.0226437 -0.0424316 0.0217822 -0.0043722 -0.0327174 0.0624798 0.0453222 -0.1108581 1.0262596 0.1012734 0.1053036 -0.0771603 0.0395289 -0.0037893 0.1429624 0.0252723 0.1031913 -0.2091436 -0.0500085 0.0065658 -0.1161953 0.0051966 -0.056971 0.020199 -0.0432137 -0.1822733 -0.2280772 0.0135931 -0.0142277 0.1054509 -0.0700702 -0.0024845 -0.0341238 -0.0193483 -0.1507108 0.0366661 0.0402516 0.0132282 0.1236078 0.1128528 -0.0376262 -0.0023355 -0.0478556 -0.1252475 0.0324987 -0.050629 0.0344893 -0.1129425 0.1170974 -0.0709901 0.048158 -0.0648824 -0.1204214 0.015596 -0.0149301 0.0272465 -0.006697 -0.1211545 -0.0115704 0.0265247 -0.0122664 -0.1624744 -0.0727073 0.0202733 -0.057908 0.0350077 0.1178984 0.0259508 -0.0613665 0.0197334 0.0751839 0.0619127 -0.1035444 0.0177012 -0.100914 -0.0583842 0.0533811 0.0052386 0.0159761 0.0772433 0.1021095 0.067629 0.0556479 0.0599352 -0.0009418 -0.0734712 0.0591698 -0.0452748 0.0256651 0.2677919 -0.0474534 -0.0232379 -0.0159129 0.1780498 0.0448773 -0.0500244 0.0320107 0.2912863 0.5741405 0.1531499 -0.0259645 0.0371922 0.324892 0.0135091 -0.0116788 0.0121237 0.3033948 0.017752 0.1073453 -0.0423601 0.0888452 -0.0200734 0.0510453 -0.0392991 0.0531303 0.1493998 0.1506671 -0.0507756 0.0067136 -0.0370211 0.0638819 0.0198138 0.0023744 0.0203628 0.1758433 0.0243405 -0.0857077 0.0010221 -0.1029167 -0.0542257 0.0323418 0.0044175 0.0346292 0.1516985 0.0306491 0.0647227 -0.0297378 0.0906045 -0.0467827 0.0553574 -0.0356848 0.0521323 0.1382934 -0.1195032 -0.0027567 -0.0368461 -0.0018646 0.0964142 0.0149883 -0.0370719 0.0153644 0.159464 unknown
polarizability: 178.8719914|10.5167452|121.3142029|12.3690611|-11.7408364|73.5261198 unknown
InChI: InChI=1S/C10H10F3NO2/c1-9(16,10(11,12)13)8(15)14-7-5-3-2-4-6-7/h2-6,14,16H,1H3
charge 0 multiplicity 1
26 atoms
F  -1.914331 1.945849 0.07692
F  -2.469843 0.44597 1.698129
F  -3.983732 1.017968 0.115946
O  -2.927704 -1.585538 -0.30834
O  -0.399359 -2.001293 0.11291
N  0.31187 0.196111 -0.342245
C  -2.115668 -0.423851 -0.585346
C  -0.625957 -0.79634 -0.222894
C  -2.634275 0.717839 0.330972
C  -2.272221 -0.030469 -2.069865
C  1.725021 0.111145 -0.132572
C  2.469403 1.30948 -0.293471
C  2.384792 -1.096125 0.215547
C  3.866108 1.30316 -0.109099
C  3.784918 -1.08412 0.396006
C  4.532861 0.104299 0.236436
H  -3.346009 0.06139 -2.30049
H  -1.77049 0.920653 -2.318439
H  -1.852006 -0.834397 -2.695306
H  -0.044149 1.133708 -0.553787
H  -2.300966 -2.283731 0.055364
H  1.957179 2.243422 -0.558545
H  1.806627 -2.012659 0.343448
H  4.431513 2.232693 -0.234033
H  4.292459 -2.016698 0.665704
H  5.618262 0.098636 0.38005
