program: Gaussian 09
title: 000037541
version: EM64L-G09RevD.01
frameworkgroup: C1[X(C17H11F3N2O2)]
method: RPBEPBE
basis: SDD
operation: Freq
keyword: #p
keyword: freq=noraman
keyword: PBEPBE/SDD
title: #p freq=noraman PBEPBE/SDD
converged: YES YES NO NO
title: Mulliken charges:
elementType: F F F O O N N C C C C C C C C C C C C C C C C C H H H H H H H H H H H
charge: -0.178836 -0.153005 -0.153148 -0.428481 -0.321504 -0.509356 -0.008100 0.251302 0.332719 -0.111139 0.228277 -0.363960 0.351816 -0.318298 -0.371232 -0.256215 0.270376 0.040510 -0.388119 -0.366613 -0.294895 -0.216938 -0.250972 0.155379 0.377908 0.241644 0.261554 0.273029 0.240587 0.245844 0.274272 0.277968 0.235868 0.240048 0.391712
chargesum: 0.00000
title: Mulliken charges with hydrogens summed into heavy atoms:
elementType: F F F O O N N C C C C C C C C C C C C C C C C C
charge: -0.178836 -0.153005 -0.153148 -0.036769 -0.321504 -0.131449 -0.008100 0.251302 0.332719 -0.111139 0.228277 -0.122315 0.351816 -0.056744 -0.098203 -0.015629 0.270376 0.040510 -0.142275 -0.092342 -0.016927 0.018930 -0.010924 0.155379
polarizability: 3.58391371e+02 1.54723323e+01 2.38636056e+02 1.44862649e+00 -6.37375904e+00 1.03493266e+02
1716.lowfreq: -10.8312 -3.1599 -0.5627 -0.0010 -0.0008 -0.0008 24.6751 25.5485 49.3355
frequency: 24.6198 25.4758 49.3259 56.6736 78.7261 104.0827 129.1457 139.9209 156.4208 173.1798 193.3302 219.7024 246.3282 273.7276 297.1103 311.2942 324.1261 333.7595 394.6535 421.7921 441.8499 448.2498 468.8598 488.1204 492.5926 518.8071 538.0544 557.7314 565.5816 580.5839 583.0659 593.3451 602.2910 626.2141 675.4909 682.2681 698.0677 740.3951 763.9216 770.3114 779.1678 791.9566 811.7609 812.8662 827.7398 836.0185 852.5926 886.6642 893.2979 936.8107 959.0677 976.6120 988.3639 990.9564 996.3365 1014.9384 1014.9971 1027.4959 1048.3418 1079.8279 1103.6928 1114.1120 1164.7328 1172.6766 1180.9026 1213.2324 1227.7890 1234.6965 1278.8567 1292.2079 1321.4785 1337.5213 1340.5338 1368.1560 1389.8759 1398.1321 1424.3163 1441.6154 1456.4492 1464.3385 1502.5761 1530.7576 1561.9963 1579.6144 1582.5584 1610.1842 1619.1940 1646.8079 3128.2880 3139.5089 3139.5521 3161.5512 3162.0436 3176.3318 3181.9472 3183.1377 3187.3076 3225.8674 3532.4204
redmass: 6.7362 7.9538 7.1524 10.7791 8.3857 8.4737 6.8030 6.8031 6.2346 5.3807 4.7222 6.5801 6.2712 6.1451 10.6851 6.9892 8.3488 6.4211 9.0539 3.2004 9.7900 9.8362 3.2110 6.9958 7.2911 3.4072 6.7400 7.2835 6.5413 1.2139 7.1846 3.5637 5.2464 10.0240 5.8579 4.1252 6.3609 2.8014 4.0462 1.7709 1.6328 4.4529 4.5583 5.5958 2.0198 1.5634 1.8240 1.4102 4.7641 1.4089 1.4175 1.3695 3.2704 1.9046 1.3492 6.8123 5.9796 4.6925 2.3570 2.8055 1.9577 1.8947 1.7559 1.7428 1.0983 1.5331 2.1221 1.8873 2.1437 2.8736 2.0825 3.5283 2.2779 3.4931 5.9767 2.7845 3.4715 2.6830 2.4261 2.7515 3.5830 4.1454 6.4811 6.6324 6.8746 4.3198 5.5360 2.4069 1.0905 1.0876 1.0877 1.0905 1.0934 1.0944 1.0967 1.0968 1.0958 1.0799 1.0642
irintensity: 0.6906 0.4076 0.4671 0.2776 0.8382 0.4133 0.3045 0.2685 1.4894 3.5855 0.7713 5.9114 3.3503 1.9021 0.2847 3.3775 3.7281 3.2991 8.0902 12.6364 2.3593 4.5614 5.2444 1.1252 17.2384 15.1372 2.3754 10.3052 1.6230 109.3825 54.3462 1.2799 33.1173 23.5020 11.6101 41.1377 1.6711 12.3849 29.7983 9.5485 98.1714 30.8906 11.4721 5.9415 93.2314 19.5039 44.7104 6.2992 40.3223 12.9872 0.4690 0.6692 94.9238 56.1181 6.3157 171.9641 409.4295 44.7840 0.4403 22.5054 13.6503 242.5892 79.9042 58.0081 0.0242 27.4983 28.6501 31.2639 147.5792 172.9494 26.2862 96.1251 154.2374 4.9933 28.2941 76.3590 41.1461 77.2022 89.0990 24.6240 33.8593 536.3753 57.7525 94.6597 446.0323 61.0218 119.1990 102.1279 22.2818 7.4702 1.0097 11.6571 9.0013 8.3131 5.1274 1.7723 11.8424 203.6488 80.0467
temp: 298.150 k
press: 1.00000 atm
elementType: 9 9 9 8 8 7 7 6 6 6 6 6 6 6 6 6 6 6 6 6 6 6 6 6 1 1 1 1 1 1 1 1 1 1 1
symmnumber: 1
zpe: 646533.6 jmol-1
zpe.correction: 0.246252 hartree
zpe.thermalcorrener: 0.265625 hartree
zpe.thermalcorrenthalpy: 0.266569 hartree
zpe.thermalcorrgfe: 0.197021 hartree
zpe.sumelectzpe: -1212.257316 hartree
zpe.sumelectthermal: -1212.237943 hartree
zpe.sumelectthermalent: -1212.236999 hartree
zpe.sumelectthermalfe: -1212.306547 hartree
dipole: -8.0583 1.4371 -1.0646
dipole: 8.2544
quadrupole: -148.0822 -118.0649 -139.6324
quadrupole: 9.9441 -3.1953 -0.4694
quadrupole: -12.8224 17.1949 -4.3726 9.9441 -3.1953 -0.4694
hfenergy: -1212.5035678 hartree
pointgroup: C01 [X(C17H11F3N2O2)]
dipole: 3.1600941 0.5867811 0.46476 debye
polarizability: 358.6718048|-14.3106998|237.8234261|3.2499106|10.2267441|104.025462 unknown
InChI: InChI=1S/C17H11F3N2O2/c18-17(19,20)12-6-3-5-10-14(8-9-21-15(10)12)22-13-7-2-1-4-11(13)16(23)24/h1-9,22-23H
charge 0 multiplicity 1
35 atoms
F  -5.8637 0.829597 0.276114
F  -5.053916 -0.43599 -1.409452
F  -5.093271 -1.247475 0.712409
O  5.003034 2.422636 -0.59161
O  2.698808 2.454728 -0.435104
N  1.454316 0.149813 -0.006318
N  -2.441271 -1.558122 -0.571683
C  -0.983914 0.332734 0.155801
C  0.196689 -0.456482 -0.157501
C  -2.279907 -0.269597 -0.08615
C  -3.462806 0.503214 0.194613
C  -0.917314 1.657459 0.692255
C  2.710314 -0.437901 0.186464
C  0.004128 -1.758149 -0.657176
C  -3.361636 1.802169 0.701631
C  -2.084164 2.377774 0.956805
C  -4.826064 -0.093406 -0.057871
C  3.897208 0.36855 0.002149
C  -1.318366 -2.252704 -0.835994
C  2.878512 -1.787865 0.616447
C  5.183518 -0.209913 0.194635
C  4.160646 -2.32722 0.809408
C  5.326451 -1.549935 0.582336
C  3.783372 1.79104 -0.35054
H  1.512101 1.178225 -0.140157
H  0.051179 2.11653 0.917139
H  0.846292 -2.378487 -0.969173
H  -4.269522 2.374406 0.909819
H  -2.022859 3.38927 1.369606
H  -1.463079 -3.264426 -1.233083
H  2.001295 -2.398022 0.841621
H  6.06002 0.424677 0.039399
H  4.254125 -3.363637 1.15246
H  6.32028 -1.983375 0.727017
H  4.830103 3.377385 -0.810415
