program: Gaussian 09
title: 000037624
version: EM64L-G09RevD.01
frameworkgroup: C1[X(C20H23N5O6S)]
method: RPBEPBE
basis: SDD
operation: Freq
keyword: #p
keyword: freq=noraman
keyword: PBEPBE/SDD
title: #p freq=noraman PBEPBE/SDD
converged: YES YES NO NO
title: Mulliken charges:
elementType: S O O O O O O N N N N N C C C C C C C C C C C C C C C C C C C C H H H H H H H H H H H H H H H H H H H H H H H
charge: 0.187894 -0.165182 -0.414738 -0.196718 -0.245375 -0.321951 -0.284220 -0.108030 -0.350355 -0.411272 -0.266221 -0.405027 -0.466104 -0.142806 -0.089978 -0.157366 0.106975 -0.690321 -0.655409 0.154136 0.146410 -0.367983 0.474661 0.323212 -0.404609 -0.359537 -0.341095 -0.377183 0.258338 -0.236550 -0.222416 -0.243414 0.314964 0.291981 0.311847 0.229982 0.243410 0.240797 0.241668 0.253543 0.223138 0.334884 0.272738 0.387508 0.402681 0.270703 0.245665 0.254266 0.260673 0.237081 0.236572 0.333184 0.226735 0.229260 0.228957
chargesum: 0.00000
title: Mulliken charges with hydrogens summed into heavy atoms:
elementType: S O O O O O O N N N N N C C C C C C C C C C C C C C C C C C C C
charge: 0.187894 -0.165182 -0.027230 -0.196718 -0.245375 -0.321951 -0.284220 -0.108030 -0.015471 -0.008591 -0.266221 -0.071843 -0.151139 -0.142806 0.202003 0.154481 0.106975 0.023867 0.062940 0.154136 0.146410 -0.095245 0.474661 0.323212 -0.133906 -0.113872 0.173844 0.096470 0.258338 -0.009815 0.006844 -0.014458
polarizability: 3.42498725e+02 2.09271030e+01 2.56701198e+02 -7.11958729e+00 1.04360539e+01 2.48227573e+02
1716.lowfreq: -10.0079 -5.2217 -1.7913 -0.0021 -0.0016 -0.0010 4.4221 16.6219 20.9499
frequency: -4.4571 16.2867 20.8789 24.7923 28.1558 33.2712 40.1146 48.3640 59.1585 62.6060 70.2183 90.4723 101.7016 112.8008 115.1620 132.3533 140.4135 161.0007 182.7374 194.4654 215.5795 224.5846 232.8341 239.3050 251.9897 254.2064 275.8802 287.2961 297.5179 312.4787 332.8711 340.9563 358.6597 364.4598 385.5526 400.7752 424.4290 457.1083 474.5831 484.4675 493.3675 524.4860 532.1650 556.1168 575.4549 584.6910 601.6424 613.9703 622.2929 627.5797 646.4726 651.4201 683.7447 691.9107 692.9515 701.6762 704.7106 708.6866 711.9884 733.8963 749.9469 766.6770 777.5705 811.6133 833.5324 843.8346 855.8188 861.5114 871.1396 903.1094 925.9380 933.6080 942.3587 943.3108 952.6027 975.8753 979.1801 991.7780 993.2998 998.8787 1008.4354 1027.0383 1032.8495 1054.7728 1061.8651 1065.9780 1085.9902 1107.1202 1124.5685 1125.9020 1146.1904 1163.8109 1166.6153 1168.0650 1173.9849 1194.3801 1195.8189 1198.2982 1200.5934 1210.8033 1214.5441 1219.2311 1228.1713 1248.4838 1249.8845 1260.7134 1278.2473 1280.8543 1286.1540 1305.7922 1315.1774 1332.6683 1349.6661 1363.1768 1382.6363 1384.7907 1385.4877 1401.2694 1403.7962 1445.0794 1460.8713 1463.6671 1479.5076 1480.7339 1481.2977 1484.6541 1496.2139 1504.7867 1513.3011 1591.6280 1598.6626 1610.3966 1626.0208 1680.9286 1682.2729 1732.5789 2982.6008 2982.8458 2987.4856 2991.0465 3017.2492 3025.4729 3052.6778 3055.1969 3077.1946 3084.6395 3095.9121 3097.2589 3102.6242 3106.5751 3121.6773 3127.4277 3139.7255 3150.7354 3164.7213 3349.6653 3514.6969 3521.6734 3617.8040
redmass: 6.2357 6.2642 6.7173 4.6243 6.0527 5.3125 4.7739 7.7467 7.2642 9.1873 3.6534 4.5318 7.7703 4.4978 7.0162 7.1092 5.3403 6.1994 6.1307 4.7058 4.5488 4.0688 5.2809 2.3195 6.5242 1.3180 5.3933 3.1308 1.2001 6.6133 6.1069 4.4526 5.8848 3.6445 9.2233 2.8179 5.2313 4.4786 4.4616 1.1196 5.9045 4.4919 4.8131 3.3889 4.5335 2.8865 4.4243 5.8443 1.7441 1.6315 5.7140 3.4531 6.7897 4.0720 3.6257 3.9765 2.2917 3.2117 3.3699 4.0852 2.0272 6.7708 2.1750 5.2755 4.6272 4.8727 1.2472 2.2430 2.1938 4.9554 1.7962 2.3453 2.5701 1.4719 2.7904 3.7800 1.5088 4.1150 4.0318 1.3898 1.4337 2.3414 2.9457 2.8644 2.8052 3.3477 1.6505 1.6936 2.0727 3.4769 1.9496 2.6775 1.6196 2.4685 1.0731 1.1468 2.2571 1.2813 1.5435 2.1821 1.2324 1.4481 1.9332 1.7509 1.7623 2.5076 3.0340 1.6492 2.4551 1.3477 1.6779 1.8152 1.3058 1.5076 1.9844 4.9530 1.1958 1.9164 1.1945 2.1216 1.0498 1.0467 1.0539 1.2362 1.6467 1.9660 1.1403 1.1850 1.7772 6.6011 8.9995 5.9270 7.1550 9.0581 6.9258 12.7343 1.0381 1.0649 1.0360 1.0820 1.0668 1.0841 1.0838 1.0982 1.0967 1.0991 1.1008 1.1024 1.0913 1.1000 1.0863 1.0876 1.0919 1.0962 1.1015 1.0809 1.0642 1.0778 1.0797
irintensity: 1.0719 0.3274 0.6869 0.4698 1.4022 1.0027 1.2653 1.6438 2.1476 2.4649 2.6776 6.1368 2.0440 10.2217 1.2826 1.1072 6.0321 6.0646 7.0210 4.0889 8.9082 5.1499 22.0944 15.1824 3.9428 2.1826 17.6136 0.7159 0.2076 1.6794 1.1445 0.2747 17.5040 11.9482 4.2356 0.1493 6.5764 0.8630 19.4099 141.8734 16.7474 19.8471 32.4729 77.9987 8.9195 53.5061 39.9280 3.2629 9.9129 153.5448 6.9021 19.2260 28.1114 4.5535 41.7447 10.1451 43.6250 15.9377 2.3005 29.2392 155.4964 1.7000 18.9503 17.9688 3.4434 21.7681 0.8642 0.1508 2.7009 38.3858 1.9025 0.5290 0.5495 1.7180 14.0413 12.7415 1.1860 7.5574 0.4543 1.3428 10.0025 7.6457 155.9862 22.1852 238.8299 17.3297 11.5278 4.6332 74.3233 13.4255 3.7752 15.3779 28.0192 7.6544 0.1494 0.3313 29.1018 4.3398 41.9081 24.6202 9.4497 12.7212 33.7425 11.3846 22.1061 280.3787 260.0274 3.4911 100.3128 9.6793 26.2544 85.1770 6.0554 22.7041 153.1809 11.4586 29.1405 73.5597 15.1606 7.6666 0.3007 7.8595 19.9289 63.0316 115.3755 622.5664 65.2494 77.3299 479.3767 59.0925 103.9493 5.9188 96.8024 202.9446 445.7987 352.0975 21.4621 78.9245 18.3471 30.5521 19.2041 5.0183 30.5565 35.2802 12.6960 15.5220 14.1761 18.9223 9.9934 17.4954 2.8406 1.7639 16.4612 20.7958 22.8485 143.9837 34.9743 27.4110 66.9354
temp: 298.150 k
press: 1.00000 atm
elementType: 16 8 8 8 8 8 8 7 7 7 7 7 6 6 6 6 6 6 6 6 6 6 6 6 6 6 6 6 6 6 6 6 1 1 1 1 1 1 1 1 1 1 1 1 1 1 1 1 1 1 1 1 1 1 1
symmnumber: 1
zpe: 1106094.9 jmol-1
zpe.correction: 0.421289 hartree
zpe.thermalcorrener: 0.451378 hartree
zpe.thermalcorrenthalpy: 0.452322 hartree
zpe.thermalcorrgfe: 0.356339 hartree
zpe.sumelectzpe: -1896.788692 hartree
zpe.sumelectthermal: -1896.758603 hartree
zpe.sumelectthermalent: -1896.757659 hartree
zpe.sumelectthermalfe: -1896.853642 hartree
dipole: -0.0348 0.1367 4.4427
dipole: 4.4450
quadrupole: -111.0563 -189.9312 -206.3800
quadrupole: 13.7842 6.6928 -5.4769
quadrupole: 58.0662 -20.8087 -37.2575 13.7842 6.6928 -5.4769
hfenergy: -1897.2099809 hartree
pointgroup: C01 [X(C20H23N5O6S1)]
dipole: -0.0035081 -0.4770218 1.6824662 debye
polarizability: 342.9336705|17.3003433|260.5468157|12.4387348|-7.2992921|243.9470099 unknown
InChI: InChI=1S/C20H23N5O6S/c1-20(2)13(17(28)29)25-15(27)12(16(25)32-20)22-14(26)11(10-6-4-3-5-7-10)23-19(31)24-9-8-21-18(24)30/h3-7,11-13,16,21-23,28H,8-9H2,1-2H3
charge 0 multiplicity 1
55 atoms
S  -3.185775 0.168473 1.882455
O  -2.883525 -0.486024 -2.368741
O  -7.467035 0.048811 -0.643657
O  -6.485033 2.144211 -0.896657
O  0.965642 1.75225 -0.854734
O  3.921181 -0.774111 1.998852
O  4.864517 1.87445 -1.252618
N  -3.892839 0.850578 -0.602742
N  -0.648314 0.268159 -0.067818
N  3.044215 0.301069 0.11072
N  5.294146 0.643827 0.760075
N  6.967615 1.83636 -0.149211
C  -2.955098 1.370451 0.425022
C  -5.078245 0.020277 1.417103
C  -5.121536 0.184381 -0.174563
C  -1.760829 1.044831 -0.550341
C  -2.85576 0.308665 -1.416611
C  -5.577018 -1.372049 1.841682
C  -5.831403 1.148684 2.154893
C  -6.37982 0.93699 -0.616272
C  0.664615 0.673827 -0.267359
C  1.72206 -0.303411 0.294705
C  1.604253 -1.707348 -0.328307
C  4.047872 0.006612 1.001316
C  1.821799 -2.847696 0.484247
C  1.321732 -1.879861 -1.707335
C  6.464737 0.33793 1.614639
C  7.536626 1.364159 1.125155
C  5.63246 1.499451 -0.320789
C  1.754618 -4.144518 -0.073633
C  1.253726 -3.175192 -2.263582
C  1.469023 -4.311389 -1.448219
H  -3.098842 2.410092 0.746708
H  -5.15645 -0.81907 -0.638763
H  -1.353687 1.944395 -1.044104
H  -5.529998 -1.489131 2.938624
H  -6.629704 -1.498968 1.527907
H  -4.976498 -2.174736 1.37991
H  -5.668057 1.055826 3.241127
H  -5.49069 2.149811 1.839565
H  -6.919949 1.0777 1.965584
H  -0.835242 -0.642245 0.361239
H  1.559853 -0.410163 1.386572
H  -8.288231 0.536267 -0.9257
H  3.202413 0.988617 -0.645774
H  2.076155 -2.708835 1.541153
H  1.149141 -1.005416 -2.346801
H  6.78611 -0.706856 1.456253
H  6.210799 0.458046 2.678759
H  7.65491 2.197604 1.844774
H  8.519409 0.883614 0.980944
H  7.413931 2.507437 -0.770224
H  1.928914 -5.020289 0.561507
H  1.027117 -3.299163 -3.328241
H  1.413789 -5.316585 -1.881293
