program: Gaussian 09
title: 000037514
version: EM64L-G09RevD.01
frameworkgroup: C1[X(C9H18O)]
method: RPBEPBE
basis: SDD
operation: Freq
keyword: #pfreq=noraman
keyword: PBEPBE/SDD
title: #p freq=noraman PBEPBE/SDD
converged: YES YES NO NO
title: Mulliken charges:
elementType: O C C C C C C C C C H H H H H H H H H H H H H H H H H H
charge: -0.270147 -0.073702 -0.015949 -0.519506 -0.444737 -0.303745 -0.348162 -0.714566 -0.356641 -0.696738 0.222177 0.185150 0.235192 0.216997 0.201554 0.194113 0.208009 0.197740 0.189296 0.202467 0.206648 0.234993 0.220881 0.195090 0.196349 0.209897 0.210420 0.216922
chargesum: 0.00000
title: Mulliken charges with hydrogens summed into heavy atoms:
elementType: O C C C C C C C C C
charge: -0.270147 0.148474 0.169202 -0.067317 -0.049070 0.102004 0.043600 -0.052044 0.034798 -0.059499
polarizability: 1.13794178e+02 1.14004560e+00 9.91146644e+01 -5.45771679e-01 -1.16462419e+00 8.22709554e+01
1716.lowfreq: -11.0373 0.0006 0.0008 0.0009 8.2281 9.6053 50.1193 55.8194 76.0428
frequency: 49.7852 55.7208 75.6641 92.0095 126.9825 151.5025 202.9944 221.3924 235.7380 262.7865 314.8763 380.2956 437.4863 500.6685 573.6645 644.1422 729.8844 775.1133 787.4984 835.0936 843.7597 891.4613 902.4824 928.5761 978.5388 999.0569 1008.9675 1022.2449 1054.2829 1072.1601 1080.1128 1108.5641 1121.3341 1138.2049 1152.7889 1177.3068 1201.5986 1213.0655 1242.0668 1269.2559 1272.4433 1290.1432 1292.4773 1302.3324 1319.9748 1336.7577 1344.2973 1354.7685 1361.7363 1385.6454 1389.4415 1457.7259 1461.7503 1466.4018 1470.2892 1476.2649 1477.7175 1478.2588 1487.4076 1492.8958 2916.8165 2950.1900 2956.7732 2966.2964 2969.4345 2971.9415 2979.4825 2984.5851 2992.6259 2994.6512 3009.4382 3034.5521 3037.3169 3068.2836 3071.7961 3075.3666 3080.8338 3093.0782
redmass: 3.3212 2.4787 1.7208 3.0992 2.2703 1.9464 1.1841 2.0088 1.1727 3.1279 2.5353 2.7737 2.7492 2.5066 3.3449 3.6275 1.0847 1.3027 2.7453 2.0882 1.4551 1.9689 1.8165 1.6535 1.3893 2.0752 3.0308 1.9456 2.0691 2.2469 2.3497 2.1338 2.0213 1.5080 2.2481 1.6979 1.3912 1.4746 1.2679 1.3204 1.2704 1.1639 1.1091 1.1769 1.2917 1.4240 1.3976 1.6184 1.6328 1.2576 1.2169 1.0575 1.0692 1.0756 1.0847 1.0478 1.0696 1.0425 1.0840 1.0920 1.0830 1.0598 1.0598 1.0720 1.0699 1.0363 1.0582 1.0366 1.0946 1.0702 1.1010 1.1042 1.1031 1.1008 1.0993 1.1022 1.0987 1.1000
irintensity: 5.3574 2.2221 0.0191 0.5748 0.0476 0.0770 0.1135 0.4837 0.0374 0.4305 0.7348 3.8422 2.2115 1.2142 2.7119 3.9722 9.2761 0.2801 6.7534 7.8402 0.4532 15.1396 9.4717 10.0435 17.5193 16.9502 7.0284 5.3217 8.2435 33.7437 7.4031 4.3063 12.2887 1.1226 4.7798 1.9106 6.4043 0.5490 1.9454 7.6844 3.8118 1.4827 3.0245 2.9215 1.3563 2.3156 0.2993 0.8468 6.4003 26.3204 10.8251 4.3988 3.7890 1.2301 8.9034 9.0942 2.5425 13.1012 17.2563 0.2251 47.3790 9.3319 6.4493 15.0912 93.9772 39.5994 97.3278 17.6411 3.1040 21.3716 6.0569 49.7206 72.1065 90.2609 50.3121 44.5603 37.9244 36.4886
temp: 298.150 k
press: 1.00000 atm
elementType: 8 6 6 6 6 6 6 6 6 6 1 1 1 1 1 1 1 1 1 1 1 1 1 1 1 1 1 1
symmnumber: 1
zpe: 663516.6 jmol-1
zpe.correction: 0.252720 hartree
zpe.thermalcorrener: 0.264788 hartree
zpe.thermalcorrenthalpy: 0.265732 hartree
zpe.thermalcorrgfe: 0.213886 hartree
zpe.sumelectzpe: -428.134027 hartree
zpe.sumelectthermal: -428.121959 hartree
zpe.sumelectthermalent: -428.121015 hartree
zpe.sumelectthermalfe: -428.172862 hartree
dipole: 2.2900 -0.3705 0.0607
dipole: 2.3206
quadrupole: -75.3903 -60.7552 -63.0180
quadrupole: 1.0900 -0.4675 -0.0717
quadrupole: -9.0025 5.6326 3.3698 1.0900 -0.4675 -0.0717
hfenergy: -428.3867474 hartree
pointgroup: C01 [X(C9H18O1)]
dipole: 0.9017784 0.1417289 -0.0162824 debye
polarizability: 113.7762581|-1.2196129|99.1671596|0.6788914|-0.8271038|82.2363797 unknown
InChI: InChI=1S/C9H18O/c1-3-4-5-9-6-7-10-8(9)2/h8-9H,3-7H2,1-2H3
charge 0 multiplicity 1
28 atoms
O  -2.957446 0.249885 0.056805
C  -0.569906 0.013401 -0.251921
C  -1.835459 -0.703321 0.28477
C  -0.866805 1.495311 0.10797
C  0.746911 -0.537906 0.331296
C  -2.393786 1.617565 -0.099575
C  2.01533 0.144829 -0.229655
C  -2.194262 -2.028376 -0.389543
C  3.324024 -0.454506 0.333411
C  4.589784 0.226116 -0.230872
H  -0.556869 -0.092607 -1.35732
H  -1.723128 -0.85434 1.383415
H  -0.303378 2.209744 -0.516099
H  -0.596696 1.67624 1.166453
H  0.809986 -1.627601 0.129208
H  0.727856 -0.424991 1.436156
H  -2.877562 2.283623 0.638825
H  -2.643653 1.972149 -1.118855
H  2.020567 0.057948 -1.336628
H  1.985715 1.229992 -0.002138
H  -1.410173 -2.785772 -0.203275
H  -3.148769 -2.416788 0.006032
H  -2.30481 -1.888952 -1.479723
H  3.353666 -1.540075 0.107223
H  3.317622 -0.368266 1.439317
H  4.59809 1.306862 0.006385
H  4.636797 0.125033 -1.331718
H  5.510853 -0.218598 0.188658
