program: Gaussian 09
title: 000037509
version: EM64L-G09RevD.01
frameworkgroup: C1[X(C7H14O2)]
method: RPBEPBE
basis: SDD
operation: Freq
keyword: #pfreq=noraman
keyword: PBEPBE/SDD
title: #p freq=noraman PBEPBE/SDD
converged: YES YES NO NO
title: Mulliken charges:
elementType: O O C C C C C C C H H H H H H H H H H H H H H
charge: -0.292963 -0.193618 0.284339 -0.728858 -0.731419 0.153757 -0.233756 -0.779310 -0.680954 0.234251 0.234651 0.221620 0.217159 0.239269 0.235929 0.197518 0.207387 0.263114 0.248716 0.244954 0.206232 0.229906 0.222077
chargesum: 0.00000
title: Mulliken charges with hydrogens summed into heavy atoms:
elementType: O O C C C C C C C
charge: -0.292963 -0.193618 0.284339 -0.038336 -0.039062 0.153757 0.171149 -0.022527 -0.022739
polarizability: 8.81580962e+01 -1.90869565e+00 7.98892931e+01 -1.21458377e+00 1.35135675e+00 7.81804735e+01
1716.lowfreq: -23.0209 -10.5168 0.0007 0.0008 0.0010 12.1162 43.3515 57.5232 93.1101
frequency: 43.2629 57.4064 93.0034 126.6712 164.9171 184.1356 205.7121 235.6832 241.0491 266.6626 323.2162 336.8643 359.8283 436.2357 473.1555 535.1535 609.7474 656.5831 775.5545 816.1244 884.0410 924.2283 940.5430 952.2451 993.7415 1016.2656 1042.7768 1109.6414 1126.2200 1135.8386 1153.9203 1214.1178 1248.7377 1257.7857 1359.6443 1363.4376 1373.3995 1388.7076 1394.3760 1443.2427 1449.6516 1457.2251 1458.5398 1460.4797 1471.3915 1479.6984 1483.1641 1494.9043 1619.8052 2937.6285 2986.2494 2992.1569 2994.2649 2997.9393 3003.2025 3078.1361 3090.3886 3094.8704 3098.0617 3101.4061 3104.1738 3105.3214 3124.9152
redmass: 4.2889 2.3249 2.0679 1.0862 1.9808 1.2495 1.5759 1.4006 1.6039 1.9234 2.7199 2.7533 3.4947 3.2564 3.0777 3.6446 2.6202 3.4775 2.6309 1.0932 2.5868 1.7598 2.2313 1.5091 1.4865 1.6570 3.4635 2.1780 2.1381 1.5134 2.2503 3.7492 1.6158 1.9061 1.2584 1.2755 1.2245 1.2031 1.2589 1.0536 1.0580 1.0599 1.0511 1.0427 1.0534 1.0469 1.0545 1.0813 9.1805 1.0594 1.0389 1.0359 1.0350 1.0689 1.0659 1.0911 1.0991 1.1004 1.1010 1.0997 1.1003 1.0993 1.1026
irintensity: 5.0375 0.5581 2.9959 0.3583 0.9480 0.4842 1.4907 2.7079 2.3623 9.4054 2.5765 0.3733 1.2336 0.6488 7.4831 8.2384 0.7376 2.5451 1.5218 3.2375 5.0096 11.4042 20.9451 9.9205 1.2607 2.6989 87.9176 7.8233 60.1437 28.9890 63.4226 9.3497 2.0893 0.8325 56.7607 13.4656 25.4670 23.1146 27.2439 16.7936 20.2609 4.8294 4.7902 12.8240 5.9049 12.7342 11.8942 3.8876 105.2754 45.9092 2.9226 25.4211 14.0857 8.7143 49.6390 10.0552 31.8820 7.7144 36.4891 23.9752 28.6222 28.5289 7.6272
temp: 298.150 k
press: 1.00000 atm
elementType: 8 8 6 6 6 6 6 6 6 1 1 1 1 1 1 1 1 1 1 1 1 1 1
symmnumber: 1
zpe: 516472.4 jmol-1
zpe.correction: 0.196714 hartree
zpe.thermalcorrener: 0.208684 hartree
zpe.thermalcorrenthalpy: 0.209628 hartree
zpe.thermalcorrgfe: 0.159030 hartree
zpe.sumelectzpe: -424.828809 hartree
zpe.sumelectthermal: -424.816839 hartree
zpe.sumelectthermalent: -424.815895 hartree
zpe.sumelectthermalfe: -424.866493 hartree
dipole: -1.3421 -0.1465 1.1661
dipole: 1.7840
quadrupole: -57.5905 -53.6852 -59.2342
quadrupole: -2.5315 7.9431 2.5913
quadrupole: -0.7539 3.1515 -2.3976 -2.5315 7.9431 2.5913
hfenergy: -425.0255231 hartree
pointgroup: C01 [X(C7H14O2)]
dipole: -0.5224418 -0.1104941 0.4554795 debye
dipolederiv: -1.0249783 0.2071205 -0.0973739 0.2236269 -0.5918093 0.0068944 -0.1788627 -0.0059668 -0.4127259 -0.480354 -0.1242448 0.245877 -0.1906034 -0.4910356 0.0177334 0.2432364 -0.035824 -0.7038777 0.6456626 -0.1896939 0.0629044 -0.2067408 0.2005759 0.1097535 -0.0296225 0.1578666 0.2216387 -0.0662205 0.0198413 -0.0207157 0.0323127 -0.05891 -0.1085137 0.0506322 -0.1031796 -0.1320379 -0.0395464 -0.0327841 -0.012332 0.02113 -0.0332066 0.0557578 -0.0785616 0.0199631 -0.0503205 0.3156969 0.3365081 -0.2932906 0.3808658 0.7156347 0.1560183 -0.280846 0.1746579 0.7700069 0.6206211 -0.0731693 0.1254977 -0.1914305 0.454905 -0.021877 0.3323977 -0.0664599 0.332252 -0.0044323 -0.0966326 -0.0426747 -0.0685866 -0.2566365 -0.2668748 0.0025067 -0.2574122 -0.3209324 -0.1162727 0.0483432 0.0532564 0.0637896 0.0394159 -0.0161913 0.042279 -0.0157531 0.0403942 0.0751922 0.0321523 -0.0772971 0.0486058 0.026996 0.0984192 -0.0808505 0.0637588 -0.0470923 -0.096194 0.0891649 0.0444949 0.0666705 0.0757816 -0.0141146 0.0259282 -0.0205068 0.0975122 0.0268127 -0.1288398 -0.0002694 -0.1092945 -0.0663516 -0.0067727 0.0221273 0.0277145 0.0678659 -0.1283475 0.0635937 0.0182118 0.0439296 0.0890333 0.0072506 0.0545192 -0.0085154 0.0763738 0.0995908 0.0094754 0.010686 0.010893 0.0370543 -0.1198333 -0.0152448 -0.0877025 -0.0846919 0.0598403 -0.1048853 0.012074 -0.0845359 -0.0909182 0.0397704 -0.0026161 0.0285761 0.0837888 -0.0673245 -0.0991911 0.0501238 -0.0419845 -0.1308652 0.0931549 -0.0120234 0.0830746 0.0017285 -0.0046632 0.0078545 -0.0282115 -0.0027741 -0.042125 -0.1212819 -0.1002651 -0.0704994 -0.134978 -0.0192307 0.032435 0.1030094 -0.0029356 0.1206403 0.0077909 0.0786313 0.0199234 0.0858254 0.1104709 -0.0199913 0.0301084 -0.0369944 -0.0800738 0.0211304 0.023329 0.0768475 0.0690592 0.0106617 0.0439224 -0.088796 0.077611 0.0975031 0.0377369 -0.0682527 0.0206691 0.0359976 -0.0483413 0.0869911 -0.0773012 0.1047019 0.0464032 0.0687451 -0.1087664 0.0812652 -0.0053516 0.049221 -0.0639554 0.0349282 -0.1159119 -0.0692807 0.0699618 0.0691871 0.0461173 0.0684927 0.0821351 -0.0440148 -0.0529099 -0.0223443 0.0072693 -0.1146585 0.0111377 -0.1286143 -0.0589278 unknown
polarizability: 87.6621493|-2.302582|79.5733713|-1.8165574|1.8244197|78.9923422 unknown
InChI: InChI=1S/C7H14O2/c1-5-9-7(3,4)6(2)8/h5H2,1-4H3
charge 0 multiplicity 1
23 atoms
O  -0.936172 -0.404654 0.495407
O  1.914745 0.8459 -1.18333
C  0.443962 -0.712521 0.02831
C  0.452201 -1.543051 -1.268335
C  1.053748 -1.504677 1.205586
C  1.230634 0.625317 -0.148747
C  -1.793942 0.310298 -0.471968
C  1.156669 1.630518 0.993676
C  -3.092742 0.647226 0.260924
H  0.102789 -0.960153 -2.136612
H  1.478543 -1.874366 -1.499002
H  -0.191681 -2.430613 -1.138279
H  2.118023 -1.731918 1.018147
H  0.963846 -0.938709 2.147805
H  0.502934 -2.453913 1.323147
H  -1.288086 1.233887 -0.830084
H  -1.994959 -0.333722 -1.35181
H  0.184178 1.577569 1.509701
H  1.351392 2.645959 0.613217
H  1.943105 1.392649 1.736771
H  -3.796866 1.1623 -0.417865
H  -3.573899 -0.27483 0.630676
H  -2.895822 1.303105 1.126767
