program: Gaussian 09
title: 000005706
version: EM64L-G09RevD.01
frameworkgroup: C1[X(C12H18ClN)]
method: RPBEPBE
basis: SDD
operation: Freq
keyword: #p
keyword: freq=noraman
keyword: PBEPBE/SDD
title: #p freq=noraman PBEPBE/SDD
converged: YES YES NO NO
title: Mulliken charges:
elementType: Cl N C C C C C C C C C C C C H H H H H H H H H H H H H H H H H H
charge: -0.088240 -0.133698 -0.485472 -0.312402 0.283837 -0.347985 0.270989 -0.579706 -0.675952 -0.364921 -0.406135 -0.827057 -0.249713 -0.237655 0.211369 0.230678 0.228495 0.226313 0.239165 0.197702 0.265264 0.272889 0.210982 0.225141 0.214854 0.263891 0.228564 0.228364 0.229052 0.230056 0.225510 0.225820
chargesum: 0.00000
title: Mulliken charges with hydrogens summed into heavy atoms:
elementType: Cl N C C C C C C C C C C C C
charge: -0.088240 -0.133698 -0.043425 0.142406 0.283837 0.088882 0.270989 -0.041553 -0.024975 -0.101030 -0.177571 -0.139584 -0.024203 -0.011835
polarizability: 1.86274367e+02 -1.55489122e+00 1.26733783e+02 6.41853748e+00 -1.87150502e+01 1.22309938e+02
1716.lowfreq: -12.3214 -5.4651 -0.0028 -0.0025 -0.0025 1.4953 23.9241 33.4370 40.0944
frequency: 23.8218 33.2576 40.0557 65.0597 85.9709 120.7763 152.4982 167.8193 178.4136 203.8527 230.2168 248.6751 258.5814 315.8047 372.8082 381.0894 416.5065 441.4838 503.3541 515.9458 527.6987 607.9025 650.4617 715.7687 756.6847 764.3735 772.4418 782.3133 800.5657 824.7723 882.7444 936.2115 960.3145 986.1182 987.5860 1001.1342 1013.6282 1042.1926 1042.9210 1050.9687 1072.5101 1084.8112 1108.3967 1118.8762 1168.5501 1169.7568 1184.4447 1220.5423 1227.2630 1245.5499 1268.9318 1275.6218 1291.4637 1303.2583 1348.1028 1360.0432 1370.9402 1386.1621 1389.5663 1403.0761 1433.0419 1450.4178 1457.8778 1464.1367 1471.2457 1474.4410 1478.1651 1482.3056 1486.3035 1486.6535 1587.6315 1615.7740 2864.7270 2872.8910 2939.7111 2968.4573 2982.9224 2983.9583 3034.5623 3041.3195 3057.9422 3064.2646 3078.5750 3082.4600 3088.0447 3115.7956 3127.0660 3142.8187 3151.4772 3158.7547
redmass: 4.4189 5.5423 3.3321 2.7024 2.6555 2.0668 1.1921 2.2055 3.4085 4.3108 1.6408 2.2858 2.1944 2.6626 3.0121 3.1975 3.0026 2.9393 3.2292 3.6217 3.7706 5.7354 6.2405 3.2440 1.3556 2.2276 1.3094 2.8498 1.2334 3.5891 1.2833 1.8572 1.6148 1.5834 1.5095 1.3902 1.5301 1.9677 1.6470 2.8937 2.7105 2.2508 1.7539 1.6086 1.7848 1.0662 1.9533 2.0027 2.5126 1.1815 1.4277 1.2474 1.2984 1.3106 1.8814 1.3388 1.5126 2.0155 1.3040 1.3193 1.9976 1.1062 1.1512 1.0551 1.1179 1.1452 1.3021 1.5185 1.0753 1.0729 6.4908 6.3216 1.0702 1.0709 1.0696 1.0383 1.0680 1.0533 1.0886 1.0969 1.0867 1.0626 1.0981 1.0978 1.1004 1.0861 1.0884 1.0931 1.1120 1.1005
irintensity: 0.4512 0.5714 0.1197 0.1692 1.9711 0.6937 1.6980 0.2146 4.1741 1.1534 3.4882 0.7553 6.0428 1.4286 5.5094 2.9716 0.9512 7.2912 1.9224 5.1643 2.7318 3.2933 106.1872 0.3813 52.9384 11.9596 9.0331 18.8613 8.0560 1.6283 0.3049 7.7745 2.3334 1.7793 5.9048 2.4252 14.5888 10.1512 3.8996 17.1660 36.7983 7.6241 10.1235 13.9116 19.9473 3.5536 1.2801 11.6007 25.2566 9.9618 8.2935 8.8438 22.8283 4.8129 12.5535 0.4204 1.8199 5.7526 27.6290 9.4878 3.2995 8.1462 20.7592 1.4903 15.8769 3.7128 8.8574 20.9152 6.3496 24.2481 0.2056 5.0044 31.4249 131.7014 51.0525 34.2157 29.0755 16.3810 9.0781 21.4798 11.4714 22.9020 49.6089 27.8904 43.9077 7.6802 10.9675 21.8065 15.5295 34.1944
temp: 298.150 k
press: 1.00000 atm
elementType: 17 7 6 6 6 6 6 6 6 6 6 6 6 6 1 1 1 1 1 1 1 1 1 1 1 1 1 1 1 1 1 1
symmnumber: 1
zpe: 714795.1 jmol-1
zpe.correction: 0.272251 hartree
zpe.thermalcorrener: 0.287759 hartree
zpe.thermalcorrenthalpy: 0.288704 hartree
zpe.thermalcorrgfe: 0.227246 hartree
zpe.sumelectzpe: -981.793899 hartree
zpe.sumelectthermal: -981.778391 hartree
zpe.sumelectthermalent: -981.777447 hartree
zpe.sumelectthermalfe: -981.838905 hartree
dipole: -2.2269 0.7501 1.5834
dipole: 2.8335
quadrupole: -103.9431 -90.9564 -90.5230
quadrupole: 7.2281 2.9355 -3.6487
quadrupole: -8.8023 4.1845 4.6178 7.2281 2.9355 -3.6487
hfenergy: -982.0661505 hartree
pointgroup: C01 [X(C12H18Cl1N1)]
dipole: -0.7958247 0.2858686 0.7264409 debye
polarizability: 186.8158621|-4.2607063|127.6840865|-1.333276|-18.2588571|120.8181387 unknown
InChI: InChI=1S/C12H18ClN/c1-3-14(9-8-13)10-12-7-5-4-6-11(12)2/h4-7H,3,8-10H2,1-2H3
charge 0 multiplicity 1
32 atoms
Cl 4.821905 -1.272028 -1.353164
N  1.423819 0.344896 0.394695
C  0.395209 -0.687325 0.657074
C  2.796948 -0.198408 0.291846
C  -0.998988 -0.333728 0.133551
C  1.283658 1.555056 1.246737
C  -2.151036 -1.006477 0.643421
C  3.100455 -0.483397 -1.185099
C  1.932564 2.806063 0.626964
C  -1.151915 0.628485 -0.893816
C  -3.422472 -0.681889 0.10642
C  -2.041648 -2.060812 1.734387
C  -2.424714 0.940719 -1.419537
C  -3.56858 0.28337 -0.915245
H  0.334852 -0.922042 1.748545
H  0.726504 -1.626468 0.168192
H  2.934886 -1.125785 0.890237
H  3.52586 0.537338 0.673789
H  0.201473 1.741246 1.371113
H  1.700611 1.378627 2.269519
H  2.400995 -1.208567 -1.627311
H  3.130044 0.438713 -1.782383
H  3.019412 2.676847 0.471884
H  1.471873 3.032096 -0.350815
H  1.792614 3.678913 1.290958
H  -0.249247 1.121789 -1.270541
H  -4.309506 -1.196692 0.49587
H  -1.367684 -2.889364 1.444076
H  -1.64234 -1.638783 2.677357
H  -3.029909 -2.497711 1.957066
H  -2.521918 1.688031 -2.215276
H  -4.563228 0.515886 -1.312213
