program: Gaussian 09
title: 000037508
version: EM64L-G09RevD.01
frameworkgroup: C1[X(C6H12O2)]
method: RPBEPBE
basis: SDD
operation: Freq
keyword: #pfreq=noraman
keyword: PBEPBE/SDD
title: #p freq=noraman PBEPBE/SDD
converged: YES YES NO NO
title: Mulliken charges:
elementType: O O C C C C C C H H H H H H H H H H H H
charge: -0.291252 -0.193766 0.278076 -0.726985 -0.724467 0.155604 -0.778667 -0.530596 0.233323 0.234120 0.222863 0.217361 0.240094 0.236623 0.264737 0.248635 0.245684 0.212468 0.233661 0.222484
chargesum: 0.00000
title: Mulliken charges with hydrogens summed into heavy atoms:
elementType: O O C C C C C C
charge: -0.291252 -0.193766 0.278076 -0.036679 -0.030389 0.155604 -0.019611 0.138017
polarizability: 7.06566645e+01 5.33298497e-02 7.06521197e+01 2.37497701e-01 1.75448520e+00 6.96478883e+01
1716.lowfreq: -24.4667 -12.6876 -0.0007 0.0002 0.0005 13.8536 49.0860 105.1583 138.5054
frequency: 47.8699 105.0670 138.4220 157.0505 172.0696 212.5517 239.1513 255.3418 278.0072 336.6807 355.1635 437.5333 474.7747 517.8794 603.4105 650.5705 769.6086 896.2726 929.4671 954.9472 990.1642 1008.3541 1023.0762 1113.0461 1127.4472 1144.8656 1154.2055 1222.0140 1254.1904 1366.1531 1373.9987 1390.6610 1432.1054 1444.2770 1449.0894 1453.7337 1460.1616 1465.0557 1470.2772 1480.4812 1485.8547 1621.0275 2943.0174 2986.7114 2995.0178 3000.6844 3029.8322 3079.2075 3095.9398 3100.2526 3103.4685 3104.4181 3105.7456 3125.5087
redmass: 4.3421 2.0816 1.0468 1.0897 1.3603 1.5090 1.9161 1.6560 3.0459 2.8229 2.7709 3.1016 3.2702 4.0117 2.6207 3.6028 2.7430 2.5061 1.5402 1.5005 1.7429 2.5979 2.1990 1.2681 2.2240 1.4951 2.2585 3.3532 3.5588 1.2399 1.2220 1.2046 1.1186 1.0564 1.0522 1.0560 1.0598 1.0591 1.0541 1.0544 1.0553 9.1521 1.0353 1.0391 1.0346 1.0363 1.0997 1.0911 1.1005 1.0993 1.0996 1.1002 1.0990 1.1025
irintensity: 5.6883 3.9617 0.1244 0.4729 0.4566 1.2868 4.9198 3.2715 14.2533 0.0907 0.5719 1.5046 7.1917 9.3578 2.1930 2.3904 3.9714 4.3531 0.5966 7.8288 15.6202 18.5565 42.7546 0.0843 84.0170 8.2897 56.9584 4.6360 1.8304 63.2476 33.4265 21.6289 4.4631 14.3504 15.6968 8.3632 5.3889 15.1665 7.3769 16.4875 5.0531 104.3632 56.0421 2.1140 16.4465 8.5244 63.1930 10.6224 5.7387 20.5109 28.5678 40.3029 12.4223 7.1441
temp: 298.150 k
press: 1.00000 atm
elementType: 8 8 6 6 6 6 6 6 1 1 1 1 1 1 1 1 1 1 1 1
symmnumber: 1
zpe: 443407.1 jmol-1
zpe.correction: 0.168885 hartree
zpe.thermalcorrener: 0.179444 hartree
zpe.thermalcorrenthalpy: 0.180388 hartree
zpe.thermalcorrgfe: 0.133640 hartree
zpe.sumelectzpe: -385.599683 hartree
zpe.sumelectthermal: -385.589123 hartree
zpe.sumelectthermalent: -385.588179 hartree
zpe.sumelectthermalfe: -385.634928 hartree
dipole: -0.9382 0.5557 1.1901
dipole: 1.6141
quadrupole: -50.9796 -45.5200 -54.0141
quadrupole: 0.3621 7.4222 -2.3124
quadrupole: -0.8084 4.6512 -3.8429 0.3621 7.4222 -2.3124
hfenergy: -385.7685675 hartree
pointgroup: C01 [X(C6H12O2)]
dipole: 0.3722353 -0.1125071 0.5020333 debye
dipolederiv: -0.6032784 0.1786286 0.0202182 0.1740264 -0.8853784 0.0505457 0.0456835 0.0750347 -0.4017512 -0.6067523 -0.0583043 -0.1641372 -0.0937537 -0.2691363 0.0200221 -0.1090461 0.051934 -0.7995238 0.244901 -0.2154726 -0.0739354 -0.2229668 0.5075227 -0.1357935 -0.0339873 -0.2297321 0.2699382 -0.0446481 0.004658 0.1030028 0.0130766 -0.0391898 0.0402492 0.042733 0.0826431 -0.1569592 -0.0406999 -0.0293416 -0.0204961 0.0409496 -0.0591307 -0.0485182 0.0328404 -0.074901 -0.0146556 0.846949 0.262934 0.0228235 0.2726021 0.0506157 -0.0832945 0.0056859 -0.0892755 0.9095162 -0.2511608 -0.0940114 0.268416 -0.0720585 0.0174451 0.0606513 0.2090133 0.0899488 -0.3577939 0.3424624 -0.0212875 -0.0496833 -0.1344219 0.5620754 0.0070488 -0.1206602 0.1637869 0.2242568 0.09159 -0.0232019 0.0016899 0.0010657 -0.0522592 -0.1236334 0.0214905 -0.0987701 0.0124969 0.0705635 0.0839217 -0.046417 0.0642361 -0.0471153 0.084508 -0.0229578 0.0775425 0.0611259 -0.1361471 -0.0548371 0.0035479 -0.0485497 0.0937443 -0.0058787 -0.0401059 -0.0147401 0.0673669 0.0390118 0.1020745 -0.0514189 0.0818232 -0.0357159 0.0455332 -0.0615916 0.0869771 0.042029 0.0653148 -0.0094421 0.0976321 -0.0118156 0.0827388 0.0458718 0.0930936 0.0055438 -0.0973849 -0.1039645 -0.0938654 -0.0284014 -0.0719346 0.0623909 -0.0208883 -0.0155729 -0.0249876 0.0935742 0.074411 0.0622616 -0.1000717 0.026681 0.0760941 0.0681511 -0.0766534 0.0425684 0.0441986 -0.0008377 -0.094457 -0.0182749 -0.1219185 0.0292653 0.0058438 -0.0436159 -0.0400154 0.0712116 0.1087287 0.0441876 0.0325853 0.0748757 -0.0385114 -0.0587049 0.0203695 -0.0347755 0.0788536 -0.1252991 -0.1328735 -0.0532181 -0.0457103 -0.0391624 -0.0360114 -0.0358923 -0.0938862 0.051095 0.0576904 0.0781321 -0.0590408 0.0800397 -0.0318133 0.072815 -0.0800323 0.1117373 -0.0129596 -0.0288349 0.0102964 0.1151789 -0.0062466 0.0155203 0.0114827 0.1692061 -0.0866333 -0.0846348 unknown
polarizability: 70.5794507|-0.27923|69.4910073|-0.5103575|-1.6121887|70.8862145 unknown
InChI: InChI=1S/C6H12O2/c1-5(7)6(2,3)8-4/h1-4H3
charge 0 multiplicity 1
20 atoms
O  1.107848 -0.507307 0.805434
O  -1.63555 0.038108 -1.35273
C  0.390445 0.495172 -0.031679
C  1.081512 0.725927 -1.387614
C  0.416048 1.770254 0.838408
C  -1.089208 0.030103 -0.217739
C  -1.841654 -0.405542 1.032919
C  1.300438 -1.821902 0.181044
H  0.981859 -0.144074 -2.057669
H  0.618817 1.581993 -1.906575
H  2.151388 0.943229 -1.221879
H  -0.160476 2.583081 0.362738
H  0.001384 1.56897 1.840218
H  1.46183 2.100852 0.961415
H  -1.160398 -0.859567 1.770866
H  -2.652076 -1.100186 0.759867
H  -2.305246 0.482865 1.505235
H  0.339232 -2.28777 -0.122254
H  1.776404 -2.443872 0.955671
H  1.966305 -1.767832 -0.701577
