program: Gaussian 09
title: 000037517
version: EM64L-G09RevD.01
frameworkgroup: C1[X(C13H13Cl2N3O3)]
method: RPBEPBE
basis: SDD
operation: Freq
keyword: #p
keyword: freq=noraman
keyword: PBEPBE/SDD
title: #p freq=noraman PBEPBE/SDD
converged: YES YES NO NO
title: Mulliken charges:
elementType: Cl Cl O O O N N N C C C C C C C C C C C C C H H H H H H H H H H H H H
charge: -0.040183 -0.037276 -0.265749 -0.183990 -0.282464 -0.266001 -0.356928 -0.412757 -0.462730 0.289428 0.184341 -0.014472 0.311097 0.505052 -0.666469 -0.708583 -0.319407 -0.310609 -0.076088 -0.078522 -0.255206 0.294682 0.293221 0.243359 0.366916 0.214217 0.206256 0.250302 0.233641 0.225446 0.212134 0.311460 0.309091 0.286792
chargesum: 0.00000
title: Mulliken charges with hydrogens summed into heavy atoms:
elementType: Cl Cl O O O N N N C C C C C C C C C C C C C
charge: -0.040183 -0.037276 -0.265749 -0.183990 -0.282464 -0.266001 -0.356928 -0.045841 0.125174 0.289428 0.184341 0.228888 0.311097 0.505052 0.004306 -0.037362 -0.007948 -0.001518 -0.076088 -0.078522 0.031585
polarizability: 2.68003473e+02 -2.62355184e+00 2.18587655e+02 9.28589035e+00 -1.77988736e+00 1.02672075e+02
1716.lowfreq: -5.3757 -2.8763 0.0015 0.0024 0.0026 3.9130 12.2786 27.6842 40.4601
frequency: 12.2378 27.6678 40.4477 53.0486 59.9872 98.0446 112.0730 125.0642 135.1138 154.3392 165.8717 196.1660 208.7751 212.4308 240.2689 248.8925 252.9202 266.6084 282.0968 302.5946 360.1251 385.7831 403.8977 409.0244 415.7587 447.7023 473.7603 491.1816 510.5641 538.0760 586.0136 603.2021 661.1574 684.5366 693.6071 708.5992 717.4336 732.3153 757.5734 771.6574 843.1823 860.6495 873.7791 875.9863 892.5379 921.7763 946.0277 958.8807 978.7914 986.5992 991.8917 1077.4731 1107.2309 1117.7136 1139.7328 1145.2064 1160.4458 1163.4465 1173.8715 1199.1960 1220.5821 1244.0341 1268.6657 1314.2511 1323.2355 1351.2141 1355.9435 1374.9668 1378.6236 1397.9091 1422.0281 1445.7216 1455.2686 1463.2641 1468.2599 1477.2970 1486.8676 1515.0812 1566.4119 1599.7099 1624.1458 1665.1796 1699.5964 2981.2577 2985.0723 3019.8566 3029.9629 3075.5282 3084.6924 3085.3253 3095.4479 3097.5527 3189.9619 3209.6515 3211.0769 3406.9939
redmass: 7.8004 3.0830 7.0444 6.0575 6.3209 6.0418 6.0088 4.2448 11.1839 15.5040 6.2907 4.6874 3.1135 1.0856 2.4360 3.1841 2.2223 4.8625 6.0853 6.5503 5.1154 11.8229 2.9594 5.6033 7.2996 4.9277 3.3694 5.1518 5.1594 3.7438 4.5228 8.5350 2.5290 5.0796 3.8532 2.5103 6.3528 2.3276 10.6910 8.1993 2.5468 1.5107 1.4073 1.5470 4.2894 1.2208 1.6111 2.1696 6.1196 2.0111 5.5130 4.5555 1.6618 1.9130 2.1399 2.5329 3.9969 1.1367 2.1305 2.6772 3.2859 4.4354 1.2151 1.6385 2.7393 1.4646 2.3470 10.1408 1.2128 1.2280 2.9837 2.7755 1.1871 1.0556 1.0463 1.0720 1.0486 1.7295 7.3812 7.0650 11.3376 8.9984 10.8120 1.0371 1.0360 1.0851 1.0597 1.0990 1.1035 1.0994 1.1002 1.0999 1.0940 1.0928 1.0938 1.0805
irintensity: 0.1853 0.0140 0.1749 0.6615 0.2216 1.5030 1.6749 12.8532 4.6979 0.2968 0.1471 0.5724 7.8048 0.9857 0.9531 0.5581 0.0940 8.0584 12.5156 0.4289 7.2992 21.5378 11.9456 2.3711 6.3637 0.5789 3.5012 4.2116 0.0668 0.1466 3.6056 30.2820 20.0135 5.6001 25.5773 4.9243 71.1336 91.3182 71.3848 8.0696 4.1013 44.7642 3.4999 15.9145 14.4875 3.1428 4.8634 15.0023 5.6742 1.8290 1.9315 111.3729 4.4253 5.0105 76.6605 19.8747 89.7401 5.1657 64.5664 43.0040 345.2346 283.1154 0.5595 35.3072 27.1874 100.4938 378.6849 5.8978 23.6629 33.7723 79.9230 248.2268 31.9721 9.5831 6.0661 41.5103 28.9556 451.9864 106.3477 133.3440 50.2186 608.8478 72.7428 19.1263 24.1811 4.3657 6.9370 12.2845 0.3573 57.1267 20.9885 40.1445 2.2106 8.6403 5.9923 120.9618
temp: 298.150 k
press: 1.00000 atm
elementType: 17 17 8 8 8 7 7 7 6 6 6 6 6 6 6 6 6 6 6 6 6 1 1 1 1 1 1 1 1 1 1 1 1 1
symmnumber: 1
zpe: 649283.2 jmol-1
zpe.correction: 0.247299 hartree
zpe.thermalcorrener: 0.267764 hartree
zpe.thermalcorrenthalpy: 0.268709 hartree
zpe.thermalcorrgfe: 0.195369 hartree
zpe.sumelectzpe: -1811.760440 hartree
zpe.sumelectthermal: -1811.739975 hartree
zpe.sumelectthermalent: -1811.739031 hartree
zpe.sumelectthermalfe: -1811.812371 hartree
dipole: -2.5881 1.7336 0.5423
dipole: 3.1619
quadrupole: -136.5001 -146.2543 -136.0490
quadrupole: -7.0487 -1.6897 -2.3729
quadrupole: 3.1010 -6.6532 3.5521 -7.0487 -1.6897 -2.3729
hfenergy: -1812.0077392 hartree
pointgroup: C01 [X(C13H13Cl2N3O3)]
dipole: -1.021199 -0.6905448 -0.1667635 debye
polarizability: 267.6897448|2.0639428|218.179755|-11.8484467|-7.0986971|103.393703 unknown
InChI: InChI=1S/C13H13Cl2N3O3/c1-7(2)16-12(20)17-6-11(19)18(13(17)21)10-4-8(14)3-9(15)5-10/h3-5,7,16H,6H2,1-2H3
charge 0 multiplicity 1
34 atoms
Cl 3.52509 -3.599827 0.71736
Cl 5.702702 1.229436 -0.938738
O  -0.778987 -1.221866 -0.309339
O  1.212784 2.9848 0.55995
O  -3.876666 1.702707 0.181896
N  -1.673326 0.94101 0.088956
N  0.594255 0.713368 0.111581
N  -3.476675 -0.564759 -0.285049
C  -1.161324 2.289469 0.36768
C  -0.649013 0.006953 -0.06247
C  0.353691 2.098455 0.368535
C  -4.909528 -0.941689 -0.384438
C  -3.10304 0.718483 0.001039
C  1.889946 0.092336 0.033923
C  -5.522663 -1.155155 1.019473
C  -5.032736 -2.193574 -1.274188
C  3.008118 0.866992 -0.369082
C  2.042145 -1.276504 0.373156
C  3.324655 -1.843201 0.290075
C  4.265376 0.242384 -0.423197
C  4.463219 -1.114222 -0.102556
H  -1.512733 2.670908 1.341753
H  -1.471482 3.013624 -0.405097
H  -5.428611 -0.090497 -0.863335
H  -2.742005 -1.27777 -0.39861
H  -6.600339 -1.38513 0.934816
H  -5.028493 -1.99563 1.540668
H  -5.411996 -0.242608 1.62967
H  -4.612013 -2.014779 -2.279557
H  -6.09449 -2.471758 -1.388964
H  -4.506728 -3.056314 -0.822373
H  2.902906 1.92459 -0.61094
H  1.185098 -1.881828 0.667975
H  5.45076 -1.577405 -0.155375
