program: Gaussian 09
title: 000037534
version: EM64L-G09RevD.01
frameworkgroup: C1[X(C15H11NO2S)]
method: RPBEPBE
basis: SDD
operation: Freq
keyword: #p
keyword: freq=noraman
keyword: PBEPBE/SDD
title: #p freq=noraman PBEPBE/SDD
converged: NO YES NO NO
title: Mulliken charges:
elementType: S O O N C C C C C C C C C C C C C C C H H H H H H H H H H H
charge: 0.236428 -0.404744 -0.235227 -0.037076 0.381102 -0.394351 0.490169 -0.555665 -0.356246 -0.275245 -0.368303 -0.621920 0.499206 -0.379659 -0.357054 0.210634 -0.221071 -0.232627 -0.235585 0.265418 0.247027 0.265194 0.249139 0.246127 0.275867 0.234330 0.231857 0.230641 0.233249 0.378385
chargesum: 0.00000
title: Mulliken charges with hydrogens summed into heavy atoms:
elementType: S O O N C C C C C C C C C C C C C C C
charge: 0.236428 -0.026359 -0.235227 -0.037076 0.381102 -0.394351 0.490169 -0.290247 -0.356246 -0.028218 -0.103110 -0.126655 0.499206 -0.103792 -0.122724 0.210634 0.010786 -0.001985 -0.002336
polarizability: 3.61537716e+02 1.75742666e+01 1.88408527e+02 -1.36912309e+01 1.09742814e+01 8.84536801e+01
1716.lowfreq: -4.6166 -0.0016 -0.0012 0.0019 5.4369 6.5854 21.5090 26.9300 33.5216
frequency: 21.5036 26.9244 33.4146 60.9253 74.7843 94.4326 149.0757 166.4231 219.6919 259.7756 292.0206 318.6203 331.9283 373.6323 397.9877 399.2021 432.4242 465.7978 474.8995 526.9561 563.0451 575.8902 597.2977 610.9567 626.7719 643.5872 659.5936 675.4093 693.5618 714.5917 742.8835 779.5646 781.2495 818.7449 851.7782 859.6082 899.2248 906.4851 920.9945 936.1471 962.3997 964.9333 984.8837 988.1698 1003.9916 1026.7318 1044.3694 1063.2543 1087.1421 1139.1945 1158.6763 1173.8317 1182.3053 1190.6137 1215.5304 1256.0472 1273.1614 1287.8527 1320.5753 1326.6810 1377.5870 1383.5990 1430.5450 1437.5617 1451.8321 1457.6725 1470.9241 1528.2255 1558.4247 1583.6886 1608.7338 1618.6075 1659.4624 3020.7981 3104.2347 3125.7502 3133.8069 3144.4194 3147.2354 3158.0939 3162.0120 3166.3378 3172.5124 3506.0372
redmass: 6.4186 6.9651 4.9074 5.6910 8.3283 5.6071 7.9944 4.8887 5.2054 6.6194 5.9825 6.0862 6.0690 5.7017 3.1700 2.8105 3.1580 3.8779 3.9421 4.2408 7.5866 3.3569 4.7224 6.4001 4.7528 8.3845 1.7431 6.0034 1.7621 5.3062 4.1262 1.9123 3.8349 1.7441 1.2563 2.7337 4.0221 2.1997 2.4987 1.4385 2.2225 1.4742 1.3804 6.2132 1.3350 2.1640 6.1882 1.9622 1.6006 2.0204 1.4993 1.0569 1.2327 1.1176 3.0293 1.9003 1.4574 2.4377 1.3544 2.2655 3.7345 7.8655 3.6795 2.4681 1.9223 1.3960 2.5155 7.5311 6.4482 6.0434 6.1809 6.9502 8.4924 1.0622 1.1001 1.0865 1.0878 1.0884 1.0928 1.0927 1.0964 1.0971 1.0999 1.0639
irintensity: 0.5322 1.9028 0.8829 2.2514 0.2967 1.9377 0.2614 0.0204 0.3159 1.4606 0.9116 0.5324 3.8101 1.6612 2.6361 0.0397 1.8709 7.7715 6.7484 60.0207 0.3591 20.1485 6.4853 7.0777 19.5809 37.9032 137.0499 5.6167 51.1371 30.1310 1.2880 62.6171 0.2876 43.3040 0.1061 6.5709 25.2990 20.1844 34.8283 4.9568 22.2489 8.5262 0.3190 0.2561 0.5219 5.3778 20.7299 225.4264 7.6174 9.8946 17.2055 0.3542 26.7463 5.6252 13.1864 7.5908 2.3158 21.3019 6.1640 84.8429 15.0381 0.2457 8.1717 15.0110 34.2432 12.1283 40.9222 46.9455 8.7956 0.2054 2.3605 4.0524 218.0114 13.0558 4.1471 7.2314 1.8050 0.5126 21.1000 3.7883 21.3884 5.6822 22.1753 24.2827
temp: 298.150 k
press: 1.00000 atm
elementType: 16 8 8 7 6 6 6 6 6 6 6 6 6 6 6 6 6 6 6 1 1 1 1 1 1 1 1 1 1 1
symmnumber: 1
zpe: 580405.7 jmol-1
zpe.correction: 0.221065 hartree
zpe.thermalcorrener: 0.236950 hartree
zpe.thermalcorrenthalpy: 0.237894 hartree
zpe.thermalcorrgfe: 0.174752 hartree
zpe.sumelectzpe: -1180.169912 hartree
zpe.sumelectthermal: -1180.154027 hartree
zpe.sumelectthermalent: -1180.153082 hartree
zpe.sumelectthermalfe: -1180.216224 hartree
dipole: -1.1572 -0.6973 -0.0690
dipole: 1.3528
quadrupole: -100.1857 -109.2267 -117.8137
quadrupole: -6.3648 -2.0788 -0.0201
quadrupole: 8.8897 -0.1514 -8.7383 -6.3648 -2.0788 -0.0201
hfenergy: -1180.3909764 hartree
pointgroup: C01 [X(C15H11N1O2S1)]
dipole: -0.4518489 -0.2733291 -0.0663664 debye
polarizability: 361.1448909|21.2799055|184.0046239|-10.393901|24.125898|93.2504082 unknown
InChI: InChI=1S/C15H11NO2S/c17-14(18)9-10-6-7-13-12(8-10)16-15(19-13)11-4-2-1-3-5-11/h1-8,17H,9H2
charge 0 multiplicity 1
30 atoms
S  -1.147351 1.990108 0.435408
O  5.334518 -1.814154 0.773689
O  5.881565 0.44218 0.728283
N  -0.710071 -0.542894 -0.393491
C  0.547393 0.077257 -0.340108
C  0.539129 1.446641 0.085185
C  2.973902 0.184096 -0.578681
C  1.773703 -0.547835 -0.670221
C  -1.697709 0.258977 -0.037838
C  1.734751 2.184086 0.184744
C  2.9465 1.543974 -0.148677
C  4.305904 -0.472868 -0.949823
C  -3.1175 -0.108879 0.006649
C  -3.495716 -1.433488 -0.357062
C  -4.124118 0.81384 0.401313
C  5.251549 -0.522468 0.240951
C  -4.849547 -1.818902 -0.324543
C  -5.478199 0.422544 0.431761
C  -5.84714 -0.894284 0.069441
H  1.765122 -1.594692 -0.98921
H  1.734747 3.228095 0.511388
H  3.889184 2.095812 -0.065757
H  4.808683 0.115704 -1.738527
H  4.140004 -1.494849 -1.323599
H  -2.711829 -2.134798 -0.658734
H  -3.850905 1.837367 0.684645
H  -5.130213 -2.83976 -0.605909
H  -6.245113 1.142322 0.737445
H  -6.899837 -1.196617 0.093909
H  5.928692 -1.804315 1.573368
