program: Gaussian 09
title: 000037535
version: EM64L-G09RevD.01
frameworkgroup: C1[X(C15H11NO2S)]
method: RPBEPBE
basis: SDD
operation: Freq
keyword: #p
keyword: freq=noraman
keyword: PBEPBE/SDD
title: #p freq=noraman PBEPBE/SDD
converged: YES YES NO NO
title: Mulliken charges:
elementType: S O O N C C C C C C C C C C C C C C C H H H H H H H H H H H
charge: 0.223735 -0.406202 -0.231690 -0.024406 -0.355914 0.326877 0.461009 -0.472655 -0.347474 -0.342807 -0.346028 -0.624790 0.497327 -0.378726 -0.357456 0.211463 -0.220820 -0.232460 -0.235384 0.252740 0.260303 0.264582 0.250234 0.243977 0.276007 0.233987 0.232014 0.230477 0.233207 0.378874
chargesum: 0.00000
title: Mulliken charges with hydrogens summed into heavy atoms:
elementType: S O O N C C C C C C C C C C C C C C C
charge: 0.223735 -0.027329 -0.231690 -0.024406 -0.355914 0.326877 0.461009 -0.219916 -0.347474 -0.082504 -0.081446 -0.130579 0.497327 -0.102719 -0.123469 0.211463 0.011194 -0.001983 -0.002176
polarizability: 3.72473995e+02 8.35581961e+00 1.84840520e+02 -1.56708016e+01 2.50503459e+00 8.75947159e+01
1716.lowfreq: -7.9556 -5.0839 -2.6416 -0.0012 0.0005 0.0008 20.0898 29.2045 36.6395
frequency: 20.0237 29.1915 36.6069 41.1008 78.5597 97.3459 145.7206 192.1407 214.4657 225.8811 266.3050 322.0486 353.7792 387.4027 399.3529 409.3381 433.2188 466.8414 476.8357 506.5022 538.5082 572.1254 608.7556 611.8296 626.9197 638.4695 652.5730 682.9576 693.1325 717.4376 746.6059 779.0768 804.6959 830.5267 851.5454 858.3652 868.1166 892.4824 913.8847 935.6170 940.4112 971.7714 984.6200 988.0819 1003.9310 1026.0813 1040.1550 1059.9504 1086.5984 1129.5404 1173.8928 1178.6751 1188.8184 1196.4552 1203.1224 1260.9185 1270.6116 1294.6415 1321.0822 1321.8931 1377.6844 1383.1229 1414.4232 1436.3712 1452.1013 1459.1041 1470.4083 1527.0431 1563.3290 1583.4202 1607.0657 1616.1371 1662.6196 3019.6961 3104.2437 3126.0181 3134.1765 3145.8374 3147.5097 3150.4932 3162.1261 3172.6597 3172.7924 3507.7559
redmass: 6.0848 7.0338 6.0890 6.2240 6.4406 5.8497 6.1643 5.6673 5.4533 5.5584 7.3794 5.8983 6.1290 4.1015 2.8066 3.3529 3.1068 4.7418 4.4950 6.4614 4.3157 3.2416 6.3930 3.7370 3.6896 8.6937 2.2784 4.5594 1.7587 5.2330 4.6514 1.8460 3.6393 2.2962 1.2575 1.9774 5.1988 1.9161 5.5396 1.4389 2.1998 1.3617 1.3800 6.2261 1.3349 2.1544 2.8188 2.0169 1.6001 1.5014 1.0605 1.2195 1.3770 2.5675 1.9002 1.8981 1.4347 2.5902 1.9408 1.5102 3.6476 7.5642 3.6084 2.3677 1.4568 1.9369 2.4325 7.7686 6.2313 6.0513 6.2880 6.9372 8.5806 1.0622 1.1000 1.0864 1.0878 1.0894 1.0928 1.0926 1.0965 1.0968 1.0996 1.0639
irintensity: 0.2146 2.1881 1.2176 0.4638 0.7506 0.3911 0.5182 1.2851 1.1124 0.2002 0.6189 5.4561 0.6805 2.4096 0.0270 2.5465 3.1448 13.4295 6.5103 2.4318 42.6375 23.6269 13.4121 26.8440 12.9963 40.5571 119.2826 19.8329 54.0131 13.4059 0.0676 55.6311 14.5652 46.3804 0.1956 4.3527 2.3051 7.4615 64.6581 4.8975 21.9879 1.6971 0.3375 0.3164 0.5229 6.3600 33.5300 197.5052 12.3310 18.2430 0.5020 29.1894 18.4007 8.9930 7.9784 5.9515 3.1809 10.3699 89.7221 15.9989 4.8969 0.2064 13.2642 21.8352 21.0698 20.4156 41.1236 26.0460 4.4545 3.9385 14.5504 27.4743 222.5780 13.2669 4.9479 7.3536 1.8512 1.7609 21.7021 7.1598 21.2317 6.4499 20.4928 24.7339
temp: 298.150 k
press: 1.00000 atm
elementType: 16 8 8 7 6 6 6 6 6 6 6 6 6 6 6 6 6 6 6 1 1 1 1 1 1 1 1 1 1 1
symmnumber: 1
zpe: 579971.6 jmol-1
zpe.correction: 0.220900 hartree
zpe.thermalcorrener: 0.236832 hartree
zpe.thermalcorrenthalpy: 0.237776 hartree
zpe.thermalcorrgfe: 0.174452 hartree
zpe.sumelectzpe: -1180.169674 hartree
zpe.sumelectthermal: -1180.153742 hartree
zpe.sumelectthermalent: -1180.152798 hartree
zpe.sumelectthermalfe: -1180.216121 hartree
dipole: -0.7775 -1.7846 -0.0935
dipole: 1.9489
quadrupole: -96.5373 -112.5801 -117.6291
quadrupole: -7.4753 -1.5187 -0.6258
quadrupole: 12.3782 -3.6646 -8.7136 -7.4753 -1.5187 -0.6258
hfenergy: -1180.3905733 hartree
pointgroup: C01 [X(C15H11N1O2S1)]
dipole: -0.2776519 0.6804477 0.2185999 debye
polarizability: 371.2730606|-19.9176362|178.3583542|12.9579892|26.043933|95.2778153 unknown
InChI: InChI=1S/C15H11NO2S/c17-14(18)9-10-6-7-12-13(8-10)19-15(16-12)11-4-2-1-3-5-11/h1-8,17H,9H2
charge 0 multiplicity 1
30 atoms
S  -0.710216 1.530079 0.705881
O  5.703961 1.293642 -0.845987
O  5.778843 -1.027651 -0.908175
N  -1.010571 -1.015362 -0.145664
C  0.742969 0.470316 0.538638
C  0.362505 -0.832873 0.075287
C  3.074119 -0.201815 0.611605
C  2.086638 0.792638 0.806151
C  -1.72543 0.063797 0.115419
C  1.36126 -1.817071 -0.123208
C  2.703122 -1.497275 0.143929
C  4.541698 0.112562 0.910526
C  -3.181872 0.175197 -0.022356
C  -3.91833 -0.959439 -0.469881
C  -3.878405 1.37781 0.276077
C  5.394463 0.021288 -0.347454
C  -5.317107 -0.885653 -0.613036
C  -5.279081 1.44604 0.130731
C  -6.00443 0.315801 -0.313963
H  2.372668 1.789466 1.156259
H  1.068838 -2.808428 -0.480686
H  3.485389 -2.246696 -0.017792
H  4.944021 -0.624975 1.628579
H  4.642696 1.119388 1.343365
H  -3.371359 -1.879588 -0.69678
H  -3.327352 2.260786 0.621351
H  -5.874503 -1.763451 -0.957789
H  -5.804871 2.378254 0.36353
H  -7.092823 0.370359 -0.426198
H  6.228862 1.200052 -1.687657
