program: Gaussian 09
title: 000037548
version: EM64L-G09RevD.01
frameworkgroup: C1[X(C18H21N5O)]
method: RPBEPBE
basis: SDD
operation: Freq
keyword: #p
keyword: freq=noraman
keyword: PBEPBE/SDD
title: #p freq=noraman PBEPBE/SDD
converged: YES YES NO NO
title: Mulliken charges:
elementType: O N N N N N C C C C C C C C C C C C C C C C C C H H H H H H H H H H H H H H H H H H H H H
charge: -0.290256 -0.264475 -0.065669 -0.424172 -0.405857 -0.504211 0.170522 0.278951 -0.489952 -0.410354 0.013796 -0.351337 -0.366262 -0.346594 0.479330 -0.681773 -0.227435 -0.230770 -0.349033 -0.434864 0.301874 -0.385185 -0.333618 0.135751 0.218256 0.245776 0.241867 0.249139 0.234072 0.190267 0.240386 0.321625 0.250679 0.226519 0.212019 0.218389 0.225149 0.227538 0.239343 0.223593 0.272121 0.217806 0.320322 0.306025 0.300701
chargesum: 0.00000
title: Mulliken charges with hydrogens summed into heavy atoms:
elementType: O N N N N N C C C C C C C C C C C C C C C C C C
charge: -0.290256 -0.264475 -0.065669 -0.102547 -0.085535 0.102515 0.170522 0.278951 -0.025920 0.080651 0.013796 0.073003 -0.125876 -0.095915 0.479330 -0.024847 -0.002286 -0.003232 -0.109690 -0.211271 0.301874 -0.113064 -0.115812 0.135751
polarizability: 3.56538125e+02 -2.54497426e+01 2.30782820e+02 1.35667248e+01 -3.31909432e+00 1.64108407e+02
1716.lowfreq: -8.0396 -6.5790 -0.0004 0.0002 0.0007 2.3670 3.5103 25.1770 33.3529
frequency: -4.4407 25.1043 33.1053 39.1862 46.4417 59.1647 68.6773 70.0208 95.1738 107.2405 134.0114 147.7306 170.0485 190.0767 196.7626 224.5447 250.8449 276.8787 287.6209 292.9419 299.7702 308.0362 351.2268 360.5754 392.2266 411.8871 424.9353 446.4438 479.0790 511.7271 517.3472 532.9315 540.6876 582.6854 588.8423 632.5650 641.8817 668.6819 685.9746 722.5410 732.6281 750.9637 754.2656 755.2984 770.2283 793.3687 813.4937 832.1643 837.4298 848.2055 857.1368 865.9385 871.4649 879.3392 899.4269 937.2028 943.6629 978.2076 983.3303 997.8468 1006.1221 1044.4842 1057.4067 1059.1978 1076.5242 1090.1773 1090.7312 1106.3847 1135.2159 1150.8895 1164.2356 1186.5523 1203.4399 1209.8852 1232.0629 1248.1113 1272.2036 1278.6454 1282.6039 1286.8213 1290.1506 1292.3963 1314.5484 1335.9582 1339.2913 1362.3220 1368.6345 1386.6280 1390.3999 1403.7303 1429.0120 1441.2851 1448.5180 1458.8370 1464.3160 1470.2221 1473.3435 1477.2458 1485.5666 1501.6517 1510.0619 1529.3058 1561.2949 1595.2326 1595.7450 1626.1356 1632.8823 1683.0815 2950.3017 2974.6194 2976.6346 2990.7918 3006.6486 3034.7864 3065.9688 3078.6121 3079.2384 3115.7415 3130.1456 3139.3924 3141.4115 3141.9623 3157.6164 3162.9137 3171.7749 3381.4485 3493.4220 3567.9913 3568.6710
redmass: 4.7066 4.6904 4.2252 4.9048 3.8595 3.0951 2.4360 3.0414 5.4672 5.2468 1.5561 2.9891 3.3785 3.7422 4.5672 1.1392 2.7384 3.2225 3.2526 4.5807 3.0163 5.0421 5.0457 1.1815 5.1539 2.9300 4.2491 3.7530 3.7081 2.9650 4.1926 3.8454 1.2800 3.8753 6.0124 6.7379 6.4728 5.4906 3.5722 5.5004 1.4082 2.3824 1.8512 2.9767 3.3165 1.7198 1.3285 2.2478 2.2801 3.2822 1.4772 4.6886 2.2074 2.8056 2.1264 1.3801 1.3792 1.3049 1.3667 3.0767 2.0863 2.4189 2.1186 3.2277 2.4291 4.0385 2.1032 1.7326 1.4483 1.7230 1.2829 1.5201 1.6845 1.9110 3.2389 1.2907 1.3489 1.6512 1.3236 1.4162 1.2706 1.6644 1.4401 1.7167 1.8549 3.5672 2.9165 1.6693 1.2121 3.6123 3.1520 2.1172 2.7022 1.1610 1.7407 2.8545 1.0610 1.0474 1.0870 1.1544 7.9386 3.0174 5.7945 7.1675 6.8906 7.6428 6.4813 1.0613 1.0647 1.0562 1.0432 1.0656 1.0969 1.0951 1.0989 1.1005 1.0998 1.0866 1.0858 1.0963 1.0904 1.0875 1.0953 1.0962 1.0992 1.0429 1.0979 1.0779 1.0786
irintensity: 0.8112 2.1064 0.9604 2.0066 1.1230 0.2667 0.3372 0.9215 0.8425 3.8913 13.7454 3.7842 5.7636 5.1778 3.6993 0.2058 11.8609 3.5996 5.4645 23.9441 3.9421 12.6852 0.7087 62.7242 1.3850 0.7680 21.6052 4.2014 17.9386 1.3622 0.4525 11.1050 161.3389 0.4599 3.8802 2.1635 2.6859 6.2733 9.7327 10.5155 12.4225 8.9926 73.8642 17.8934 10.9553 156.1190 5.2841 44.6196 16.2203 8.9555 0.5901 21.2239 18.2134 0.4003 4.8385 2.7084 0.2226 0.1220 2.3063 0.1907 10.4271 8.9742 15.4055 4.4462 3.3829 19.9135 20.5211 4.4826 43.2242 17.6847 13.6150 76.0552 33.7391 27.9985 14.8562 5.7151 7.9235 125.5155 10.4083 67.1594 0.5917 107.7444 79.3094 11.6040 12.0807 159.0786 157.7397 8.5326 9.8476 7.4501 24.3610 462.7846 74.2928 18.9608 26.6623 4.2817 4.1609 11.8126 19.6353 48.6009 56.8026 95.3952 71.0237 19.3193 129.8521 76.9901 307.9511 31.1177 42.9301 40.0470 20.2559 30.1938 24.0779 4.7649 2.2825 72.2234 46.5540 16.6958 0.8770 22.6595 16.3812 10.1172 21.7442 11.9461 21.6392 0.2636 1.4370 62.2782 30.8387
temp: 298.150 k
press: 1.00000 atm
elementType: 8 7 7 7 7 7 6 6 6 6 6 6 6 6 6 6 6 6 6 6 6 6 6 6 1 1 1 1 1 1 1 1 1 1 1 1 1 1 1 1 1 1 1 1 1
symmnumber: 1
zpe: 958787.8 jmol-1
zpe.correction: 0.365183 hartree
zpe.thermalcorrener: 0.387403 hartree
zpe.thermalcorrenthalpy: 0.388347 hartree
zpe.thermalcorrgfe: 0.311866 hartree
zpe.sumelectzpe: -1045.760871 hartree
zpe.sumelectthermal: -1045.738651 hartree
zpe.sumelectthermalent: -1045.737707 hartree
zpe.sumelectthermalfe: -1045.814188 hartree
dipole: 1.1541 -1.0641 0.6958
dipole: 1.7171
quadrupole: -171.5419 -134.6434 -140.0266
quadrupole: 2.8079 -12.4382 -0.0750
quadrupole: -22.8046 14.0939 8.7107 2.8079 -12.4382 -0.0750
hfenergy: -1046.1260542 hartree
pointgroup: C01 [X(C18H21N5O1)]
dipole: -0.4745792 -0.3887715 -0.282838 debye
polarizability: 358.765697|19.5841172|228.5688111|12.2235881|4.8828995|164.0948445 unknown
InChI: InChI=1S/C18H21N5O/c1-2-5-17-21-15-6-3-4-7-16(15)23(17)12-20-14-10-8-13(9-11-14)18(24)22-19/h3-4,6-11,20,22H,2,5,12,19H2,1H3
charge 0 multiplicity 1
45 atoms
O  6.278375 0.442346 1.041942
N  -2.305644 0.19455 0.1794
N  -4.285816 0.83655 -0.776459
N  -0.016617 -0.250153 -0.403687
N  6.471291 -1.046462 -0.724583
N  7.88877 -1.118523 -0.62561
C  -3.044042 1.230145 -0.45194
C  -3.150616 -0.933798 0.246962
C  -2.490487 2.607825 -0.6753
C  -0.926214 0.247237 0.638058
C  -4.384383 -0.510792 -0.350615
C  -2.64518 3.541084 0.561704
C  -2.958987 -2.233517 0.755967
C  -5.468188 -1.412072 -0.439923
C  1.369755 -0.260201 -0.272918
C  -2.100929 4.957641 0.284381
C  -4.055404 -3.118944 0.659822
C  -5.289387 -2.714893 0.071765
C  2.015881 0.230947 0.902944
C  2.182125 -0.754754 -1.338955
C  4.226729 -0.283795 -0.052884
C  3.417051 0.219683 0.996645
C  3.580645 -0.764531 -1.226681
C  5.710646 -0.251555 0.137032
H  -1.424017 2.558307 -0.970902
H  -3.044296 3.046546 -1.523498
H  -0.835094 -0.355288 1.566417
H  -0.671902 1.292339 0.900487
H  -3.716413 3.588845 0.832684
H  -2.119594 3.102549 1.434243
H  -2.012207 -2.555619 1.203091
H  -0.44886 -0.659122 -1.232549
H  -6.412616 -1.095897 -0.892922
H  -2.222093 5.610825 1.16715
H  -1.025134 4.931423 0.02745
H  -2.637042 5.429041 -0.560235
H  -3.954331 -4.139895 1.044024
H  -6.113487 -3.434384 0.017311
H  1.428503 0.617848 1.741732
H  1.704489 -1.116137 -2.257954
H  3.921349 0.605595 1.888944
H  4.164695 -1.116675 -2.085394
H  6.04741 -1.751279 -1.326945
H  8.159703 -1.26498 0.359028
H  8.309566 -0.24356 -0.97143
