program: Gaussian 09
title: 000005857
version: EM64L-G09RevD.01
frameworkgroup: C1[X(C20H28O)]
method: RPBEPBE
basis: SDD
operation: Freq
keyword: #pfreq=noraman
keyword: PBEPBE/SDD
title: #p freq=noraman PBEPBE/SDD
converged: YES YES NO NO
title: Mulliken charges:
elementType: O C C C C C C C C C C C C C C C C C C C C H H H H H H H H H H H H H H H H H H H H H H H H H H H H
charge: -0.444105 -0.174649 0.350966 -0.113464 -0.092289 -0.525622 0.052214 -0.533905 -0.516260 -0.223855 -0.511728 -0.482937 -0.801547 0.500258 -0.638291 -0.478815 -0.440689 0.214003 -0.446196 -0.426820 -0.546470 0.243127 0.220575 0.231972 0.227141 0.194812 0.219591 0.223415 0.213052 0.204577 0.205778 0.250142 0.232800 0.216724 0.217726 0.217797 0.232075 0.232037 0.204255 0.216369 0.207989 0.201690 0.209277 0.202152 0.338572 0.212398 0.208016 0.210122 0.286021
chargesum: 0.00000
title: Mulliken charges with hydrogens summed into heavy atoms:
elementType: O C C C C C C C C C C C C C C C C C C C C
charge: -0.105534 0.068478 0.350966 0.107111 0.139683 -0.103669 0.052214 -0.090899 -0.098631 -0.018077 -0.028786 -0.048487 -0.119638 0.500258 -0.217667 -0.069136 -0.029260 0.214003 -0.233798 -0.008682 -0.260448
polarizability: 2.38544886e+02 2.37723747e+00 1.91491586e+02 -7.46224404e+00 -7.39064128e+00 1.84276326e+02
1716.lowfreq: -8.7022 -7.4170 0.0004 0.0007 0.0009 3.2745 40.0348 49.8150 73.8423
frequency: 39.9007 49.7620 73.8011 92.1095 120.2831 135.2146 143.1830 174.2326 188.2763 204.0106 230.0832 235.0081 266.8427 273.6277 279.1670 298.8481 308.5020 332.3186 356.3042 371.1021 381.5533 390.0499 418.6231 431.6265 438.4471 459.3681 472.6503 484.7728 504.1939 553.3311 582.7385 596.4003 618.1701 623.0565 637.9008 655.3789 660.0557 693.8101 772.6347 783.2683 805.0918 808.5029 829.1085 841.6542 844.4558 864.2068 879.5032 887.1752 924.2954 939.0501 947.3815 964.9923 966.5078 973.3410 987.0958 997.8605 1000.4193 1013.5643 1031.3844 1037.3786 1058.8894 1068.7919 1076.5496 1084.3258 1104.0479 1108.2253 1118.1848 1128.7125 1151.7017 1153.1916 1159.0698 1163.7705 1173.7628 1186.2664 1186.7367 1209.8641 1219.6611 1225.3428 1237.6424 1248.0222 1257.8641 1269.6102 1271.7612 1285.3095 1291.0277 1301.9458 1302.3956 1309.2042 1320.2087 1324.2663 1327.4359 1328.8830 1330.3424 1335.0499 1342.1078 1347.0030 1348.5747 1365.8377 1368.5685 1392.3499 1458.0045 1459.1865 1461.0064 1464.4597 1466.9627 1468.3490 1470.0768 1474.0761 1478.8032 1487.6187 1489.9633 1687.1341 2118.2673 2912.0249 2923.4080 2932.9472 2947.3334 2948.6685 2950.8268 2962.7379 2964.3816 2971.9415 2978.6893 2980.8748 2994.2186 3003.0493 3003.9459 3020.8569 3024.8524 3028.5874 3032.8002 3034.7554 3039.1578 3045.1948 3057.9038 3085.0237 3090.7291 3095.1570 3099.4521 3426.7550 3547.2330
redmass: 4.0965 3.6850 2.4251 2.4478 3.1734 2.2776 2.9226 2.6061 2.3203 2.0770 2.7893 2.9692 2.2725 1.3731 2.4617 2.8153 2.4196 2.2380 2.5422 2.5025 3.0672 3.2580 2.9066 3.1282 3.4787 3.2666 4.0635 3.1313 3.1831 2.9434 4.0606 5.2421 2.4423 1.4077 2.7878 1.2459 2.6808 2.7796 1.9374 2.0686 2.1036 1.3458 1.9902 2.1432 1.9285 2.1631 1.8760 1.7824 1.8781 2.0470 2.3317 2.2990 2.4346 2.9846 2.1307 1.9804 2.3316 2.6786 2.0356 1.8822 2.0184 1.7247 2.7619 2.2237 1.8622 1.8216 1.4512 2.1806 1.5133 1.8137 1.5657 2.0865 1.7251 1.5412 1.7603 1.7034 1.2128 1.4594 1.4872 1.4820 1.2363 1.3759 1.4576 1.3426 1.5005 1.4971 1.4243 1.3007 1.4324 1.3446 1.3950 1.3647 1.5786 1.4647 1.5750 1.4531 1.4909 1.5480 1.6051 1.1987 1.0689 1.0847 1.0892 1.0985 1.0779 1.0876 1.0727 1.0825 1.0854 1.0689 1.0732 7.4276 6.0705 1.0796 1.0788 1.0825 1.0644 1.0783 1.0684 1.0596 1.0621 1.0636 1.0663 1.0645 1.0626 1.0363 1.0915 1.0979 1.0972 1.0623 1.1004 1.1001 1.0991 1.0991 1.1007 1.0904 1.0995 1.1022 1.0986 1.1576 1.0660
irintensity: 0.0843 0.1467 0.2958 1.3627 0.1106 0.3332 0.9198 2.7962 0.1915 0.1137 0.5193 0.6848 16.9477 93.4884 33.3771 0.0538 1.8574 1.1032 0.1410 2.7901 7.6239 2.5110 4.1876 1.8946 0.5079 5.2796 15.4551 0.8305 0.5829 2.3284 1.7925 1.2641 16.2935 44.3545 14.4903 60.6292 5.0757 1.6933 0.2418 9.1886 0.7843 9.9135 2.4738 2.4312 5.7164 4.9947 9.4256 18.0539 1.9664 0.2612 3.4190 1.0540 41.4295 78.9475 6.3293 8.6041 16.2072 4.5979 11.6852 8.0930 1.3534 0.6277 2.0093 6.9229 0.2114 2.7415 3.1950 2.7923 8.2629 5.1367 3.5903 5.8396 6.8090 1.7155 0.8055 4.4160 5.0723 0.7910 1.5071 2.4763 2.1267 18.8089 19.6810 1.5992 1.8108 18.9385 7.4305 2.2537 1.4444 4.1406 0.9063 0.9555 2.9037 1.4692 0.0053 1.0689 1.1936 2.7689 1.6475 24.6794 5.9578 2.8978 10.2361 7.3846 3.9234 14.3822 14.2983 6.1121 9.2266 9.2321 7.4457 3.7586 3.0977 17.9943 1.5372 0.5796 61.7648 9.7760 62.1658 26.1412 45.9630 35.8451 21.7804 54.0095 29.6422 26.1945 53.0134 26.2370 51.3854 26.2282 18.9691 84.1091 86.3792 51.9658 19.6369 35.7911 34.9479 26.2985 23.5620 66.7248 8.4444
temp: 298.150 k
press: 1.00000 atm
elementType: 8 6 6 6 6 6 6 6 6 6 6 6 6 6 6 6 6 6 6 6 6 1 1 1 1 1 1 1 1 1 1 1 1 1 1 1 1 1 1 1 1 1 1 1 1 1 1 1 1
symmnumber: 1
zpe: 1127142.4 jmol-1
zpe.correction: 0.429306 hartree
zpe.thermalcorrener: 0.449067 hartree
zpe.thermalcorrenthalpy: 0.450011 hartree
zpe.thermalcorrgfe: 0.383144 hartree
zpe.sumelectzpe: -852.467131 hartree
zpe.sumelectthermal: -852.447369 hartree
zpe.sumelectthermalent: -852.446425 hartree
zpe.sumelectthermalfe: -852.513293 hartree
dipole: -1.1196 -0.8325 0.4630
dipole: 1.4700
quadrupole: -139.5110 -122.1443 -124.4948
quadrupole: -1.9276 1.7438 -1.2715
quadrupole: -10.7943 6.5724 4.2219 -1.9276 1.7438 -1.2715
hfenergy: -852.8964365 hartree
pointgroup: C01 [X(C20H28O1)]
dipole: 0.4308508 0.3368036 0.1881417 debye
polarizability: 238.0365522|2.9742968|191.8197521|8.7520654|7.4519979|184.456493 unknown
InChI: InChI=1S/C20H28O/c1-3-20(21)13-11-18-17-9-8-14-6-4-5-7-15(14)16(17)10-12-19(18,20)2/h1,6,15-18,21H,4-5,7-13H2,2H3
charge 0 multiplicity 1
49 atoms
O  -4.514993 0.646799 -0.769948
C  -1.174406 -0.793919 0.148864
C  -1.965815 0.281257 -0.657952
C  0.270597 -0.977613 -0.352927
C  1.02729 0.391404 -0.246248
C  -1.23616 1.637672 -0.525869
C  -3.38053 0.156227 0.050515
C  -2.129432 -2.01892 0.182919
C  0.250191 1.528029 -0.96639
C  2.495267 0.221195 -0.779481
C  -3.563973 -1.395494 0.198381
C  1.016811 -2.095982 0.414963
C  -2.143184 -0.084148 -2.154774
C  3.181901 -0.887351 0.019842
C  2.489172 -2.235449 -0.059566
C  3.36046 1.509152 -0.809076
C  3.963446 1.839017 0.575021
C  -3.416104 0.836171 1.364971
C  4.265639 -0.664105 0.813933
C  4.905056 0.69809 1.02599
C  -3.498513 1.418455 2.449382
H  -1.099423 -0.410039 1.191779
H  0.245832 -1.270991 -1.426619
H  1.0826 0.648079 0.835714
H  -1.272785 1.971004 0.530238
H  -1.740461 2.419171 -1.130991
H  -1.946052 -2.654819 1.066027
H  -1.982747 -2.653549 -0.71172
H  0.315461 1.374084 -2.063306
H  0.738795 2.499431 -0.762542
H  2.390622 -0.136666 -1.830109
H  -4.173942 -1.733627 -0.657162
H  -4.119887 -1.640273 1.117983
H  0.487851 -3.05997 0.281954
H  1.006302 -1.86449 1.50026
H  -1.177869 -0.063032 -2.687209
H  -2.58464 -1.085092 -2.296764
H  -2.821428 0.638314 -2.640437
H  2.486422 -2.602521 -1.10838
H  3.020606 -2.989344 0.551458
H  2.778206 2.36453 -1.197003
H  4.1956 1.352008 -1.521821
H  3.150907 1.961125 1.318416
H  4.514466 2.798256 0.537269
H  -4.565367 1.633462 -0.680315
H  4.704535 -1.512911 1.359946
H  5.172946 0.819216 2.094853
H  5.863026 0.758113 0.465364
H  -3.567795 1.915945 3.399166
