program: Gaussian 09
title: 000037477
version: EM64L-G09RevD.01
frameworkgroup: C1[X(C13H12)]
method: RPBEPBE
basis: SDD
operation: Freq
keyword: #p
keyword: freq=noraman
keyword: PBEPBE/SDD
title: #p freq=noraman PBEPBE/SDD
converged: YES YES NO NO
title: Mulliken charges:
elementType: C C C C C C C C C C C C C H H H H H H H H H H H H
charge: -0.211800 -0.584259 0.390299 -0.201970 0.325192 0.491672 -0.724328 -0.465966 -0.438279 -0.447114 -0.442393 -0.221003 -0.218159 0.234766 0.231464 0.231026 0.226630 0.217882 0.219056 0.239482 0.239605 0.235855 0.235573 0.218245 0.218521
chargesum: 0.00000
title: Mulliken charges with hydrogens summed into heavy atoms:
elementType: C C C C C C C C C C C C C
charge: 0.022966 -0.121768 0.390299 -0.201970 0.325192 0.491672 -0.060759 -0.226483 -0.198674 -0.211259 -0.206821 -0.002758 0.000362
polarizability: 1.69919725e+02 9.20080830e+00 1.70261698e+02 -6.38922381e+00 8.92990548e-01 6.81223899e+01
1716.lowfreq: -12.8823 -9.4025 -0.0008 -0.0007 0.0006 5.8430 38.7716 159.5480 170.4883
frequency: 38.6799 159.5425 170.4846 224.3993 241.0693 265.9122 358.6894 413.7427 459.1611 468.4089 485.2250 500.9221 536.3485 572.5429 619.2612 638.3784 654.5814 761.8803 777.1878 790.1668 795.2224 828.8105 871.2928 885.4342 905.2102 920.6693 960.0759 973.2199 982.8124 1015.2853 1034.2722 1043.4629 1068.5738 1094.8372 1111.7597 1172.2450 1180.2756 1183.0873 1212.2217 1227.2390 1243.7006 1258.9661 1281.1599 1301.4201 1375.0417 1385.9304 1393.6539 1414.3223 1451.7086 1466.7429 1468.1641 1475.8440 1476.3803 1504.8008 1602.1586 1608.6550 1629.7788 2974.0912 2975.3960 2986.6022 3038.3781 3071.7309 3077.6264 3117.9550 3118.6006 3131.3187 3132.8335 3150.7602 3152.4545
redmass: 2.6697 2.9613 3.6581 2.9316 1.2568 2.0966 3.0912 4.0281 2.9759 3.2241 4.0645 4.6181 5.9880 4.1551 3.5404 5.1625 3.1839 1.2313 3.2597 2.0105 4.8275 1.9625 2.7533 1.5321 1.4769 1.4593 2.6795 1.3316 1.3638 3.2883 2.1704 1.9099 1.9434 2.1368 2.0061 1.1983 1.3484 1.2246 1.4689 1.2352 1.8230 2.2696 1.5234 1.6928 2.6509 1.3750 3.3687 1.8422 1.2333 2.8206 3.6389 1.0727 1.1097 4.3108 6.3192 8.1837 7.7800 1.0760 1.0409 1.0631 1.1007 1.0997 1.1003 1.0855 1.0855 1.0920 1.0920 1.0987 1.0982
irintensity: 0.0023 0.5409 6.3023 3.0329 0.0355 3.4690 1.0418 1.5924 0.6806 0.0921 0.5515 0.4023 1.1957 0.8320 0.3250 1.8248 2.0966 1.3988 16.4595 57.6639 3.2272 57.6206 2.7801 4.7360 4.6960 0.6093 3.7329 0.0253 4.0141 4.1382 3.0364 1.8372 3.4908 2.4993 0.9242 0.1897 0.0441 3.0001 2.1885 0.4517 3.0031 0.3556 0.6090 4.3202 21.2309 10.8520 4.6930 0.1109 10.8396 2.0051 0.4071 8.9306 6.0003 4.6975 9.3039 18.9010 10.1339 19.3324 31.9525 37.2697 20.7061 32.1677 40.7997 1.1140 1.2311 15.8503 26.5130 60.9163 20.4899
temp: 298.150 k
press: 1.00000 atm
elementType: 6 6 6 6 6 6 6 6 6 6 6 6 6 1 1 1 1 1 1 1 1 1 1 1 1
symmnumber: 1
zpe: 543515.9 jmol-1
zpe.correction: 0.207014 hartree
zpe.thermalcorrener: 0.216971 hartree
zpe.thermalcorrenthalpy: 0.217915 hartree
zpe.thermalcorrgfe: 0.171474 hartree
zpe.sumelectzpe: -501.698125 hartree
zpe.sumelectthermal: -501.688168 hartree
zpe.sumelectthermalent: -501.687224 hartree
zpe.sumelectthermalfe: -501.733665 hartree
dipole: 0.8694 -0.5030 -0.0973
dipole: 1.0092
quadrupole: -68.3311 -68.6637 -81.0123
quadrupole: -0.7239 -1.6962 0.4270
quadrupole: 4.3379 4.0053 -8.3432 -0.7239 -1.6962 0.4270
hfenergy: -501.9051392 hartree
pointgroup: C01 [X(C13H12)]
dipole: 0.322414 -0.2291225 -0.0344423 debye
dipolederiv: 0.0478386 0.1075266 -0.0034111 -0.0009696 0.0527207 0.0020855 -0.0135897 -0.0098556 0.1664843 -0.0905743 -0.0077596 -0.0069209 0.0959142 0.0023365 0.0029291 -0.0132112 0.0114593 0.1481487 0.1345252 -0.0927104 -0.030512 -0.219035 0.1408753 0.0070835 -0.0920641 0.0484735 -0.0448601 -0.1901415 0.0854052 0.004751 0.1175373 -0.1444217 -0.0040785 0.0204444 -0.0172835 -0.0403258 0.2617823 -0.1987921 -0.025441 -0.1167849 0.0957544 -0.0013149 -0.0142386 0.0100093 -0.0346777 0.0356965 0.1878562 0.0084844 0.1877048 0.1160873 -0.0127414 0.0156458 -0.0119239 0.098915 0.0338819 -0.0258892 -0.0639293 0.0255352 0.0476854 0.000424 -0.0024176 -0.0324252 0.0347968 0.0253945 0.0332867 -0.0226539 0.175954 -0.1914777 -0.00616 -0.004399 -0.0056031 -0.1902459 -0.2407857 0.1110516 -0.0033693 -0.0181179 0.0827741 0.0135249 -0.0005579 -0.0004981 -0.1945283 -0.0704441 -0.1343551 -0.02058 -0.11101 -0.0206993 0.0211067 -0.0151168 0.0199722 -0.2074408 0.0299266 -0.0934578 -0.0266171 -0.1151514 -0.1194736 0.0149907 -0.0258193 0.0116239 -0.2071578 0.0684156 -0.0015427 -0.0189858 -0.0851459 0.1337205 0.0167066 -0.0235057 0.0134121 -0.1432083 0.1410509 -0.061568 -0.0256967 0.0133931 0.0519843 0.004357 -0.022561 0.0154613 -0.1423287 -0.0226467 0.0176221 0.0674198 0.0309475 0.0203414 0.0007652 0.0903412 -0.007611 -0.1207273 0.0034004 0.0647603 -0.0313652 0.0431715 0.0010591 0.0765919 -0.0614041 0.1350962 -0.0402018 0.0153456 0.0325522 0.0181195 0.0081181 -0.016765 -0.0970657 0.0423598 -0.1465943 -0.0413461 0.0468264 -0.0153086 0.1099221 -0.0083391 0.0810416 0.0089207 0.0361074 0.0127435 -0.1152696 -0.046255 0.1189213 -0.0088913 0.1856287 -0.0919372 -0.0130117 -0.0056485 -0.0276856 0.0705279 -0.0088291 -0.0867012 -0.0124517 -0.1722383 -0.0611181 0.0043213 -0.0041534 0.0282702 0.0757779 -0.1097547 -0.0806694 0.0214221 -0.0579206 0.0678446 -0.0012899 0.0208636 -0.0023673 0.1500697 0.0819903 -0.0144375 0.0066228 -0.0393831 -0.131292 -0.0074285 0.0043857 -0.0076147 0.1550839 -0.0344651 0.1273071 0.0212662 0.0683062 -0.0170325 -0.0123253 0.0200722 -0.0198203 0.158346 -0.06235 0.0611794 0.0202124 0.1217297 0.0094902 -0.0158167 0.0230483 -0.0121435 0.1585972 0.0761618 -0.045836 0.0043944 -0.0364247 -0.1566301 -0.0063722 0.0049134 -0.0074104 0.1529521 -0.1259906 -0.088441 0.0182106 -0.0934198 0.0471316 0.0037978 0.0205051 0.0023149 0.1526188 unknown
polarizability: 171.8202647|9.0677564|168.5117229|-4.6332572|2.1227365|67.9718252 unknown
InChI: InChI=1S/C13H12/c1-9-8-11-6-2-4-10-5-3-7-12(9)13(10)11/h2-7,9H,8H2,1H3
charge 0 multiplicity 1
25 atoms
C  2.097138 -0.803887 -0.329244
C  1.111508 -2.039667 -0.234856
C  1.182035 0.418282 -0.181439
C  -0.169835 -0.017547 -0.073704
C  -0.287346 -1.437541 -0.113727
C  -1.283468 0.868626 0.059485
C  3.232094 -0.853757 0.721963
C  1.45043 1.788246 -0.148813
C  -1.558424 -2.008997 -0.025944
C  -0.98083 2.272358 0.088901
C  -2.579655 0.256114 0.146349
C  0.350561 2.705591 -0.010743
C  -2.699532 -1.141545 0.101712
H  2.563034 -0.787333 -1.33555
H  1.355381 -2.658143 0.651074
H  1.202755 -2.699747 -1.117562
H  2.814433 -0.878591 1.745197
H  3.85917 -1.753743 0.58229
H  3.888893 0.032291 0.645577
H  2.471774 2.17802 -0.228179
H  -1.704693 -3.094821 -0.050441
H  -1.791209 3.00423 0.188908
H  -3.474311 0.882055 0.246853
H  0.564731 3.780729 0.013467
H  -3.696137 -1.594023 0.168224
