program: Gaussian 09
title: 000037476
version: EM64L-G09RevD.01
frameworkgroup: C1[X(C12H16)]
method: RPBEPBE
basis: SDD
operation: Freq
keyword: #p
keyword: freq=noraman
keyword: PBEPBE/SDD
title: #p freq=noraman PBEPBE/SDD
converged: YES YES NO NO
title: Mulliken charges:
elementType: C C C C C C C C C C C C H H H H H H H H H H H H H H H H
charge: -0.205831 -0.468704 0.149350 -0.576561 0.315954 0.304112 -0.732709 -0.632774 0.487369 -0.589899 -0.825082 -0.821423 0.218201 0.210366 0.223421 0.225582 0.225910 0.226146 0.215875 0.221685 0.242050 0.230011 0.231017 0.223129 0.227120 0.221816 0.230969 0.222901
chargesum: 0.00000
title: Mulliken charges with hydrogens summed into heavy atoms:
elementType: C C C C C C C C C C C C
charge: 0.012369 -0.034917 0.149350 -0.125069 0.315954 0.304112 -0.069004 -0.390724 0.487369 -0.359888 -0.143816 -0.145737
polarizability: 1.58640369e+02 6.10750469e-01 1.36588691e+02 -2.68142318e+00 -2.29174724e+00 8.10485246e+01
1716.lowfreq: -13.3816 -0.0006 -0.0001 0.0005 3.9606 14.8421 33.5848 77.5426 97.2088
frequency: 33.5604 77.5339 97.1544 119.5962 180.0749 210.2039 225.5960 228.1468 248.1993 266.5106 342.4305 406.9632 460.6002 472.3556 505.5718 550.0845 574.0251 582.8944 656.2414 730.7495 756.8844 795.2258 863.4806 887.3246 898.8888 930.7655 951.2570 955.2387 973.6336 1013.4707 1018.2361 1027.9433 1038.6746 1048.4694 1076.4392 1090.1578 1134.3330 1159.7807 1178.6359 1204.0976 1245.4250 1268.8267 1278.7258 1305.8597 1308.1845 1323.8345 1376.9030 1382.1369 1395.3546 1397.1597 1420.1354 1455.4466 1462.5923 1469.2796 1469.8384 1472.1424 1474.9847 1479.3208 1480.6679 1489.1597 1599.8081 1621.2386 2970.3229 2970.9672 2971.2062 2973.4965 2980.2888 3001.6429 3039.5815 3047.2580 3050.7431 3063.5839 3068.5327 3073.5242 3078.7188 3079.7098 3103.8953 3114.4531
redmass: 1.0190 1.9390 1.4419 2.0602 2.4014 3.0006 1.2758 2.2103 2.2648 2.4936 2.4669 2.9834 3.9271 3.3830 2.9172 4.2579 2.9071 4.1668 2.5507 3.4000 2.8604 2.0071 1.3376 1.6410 1.5765 2.7768 2.1600 1.6747 2.8178 1.6001 1.6768 1.7270 1.5786 1.5731 1.7894 1.7339 2.1468 1.4382 1.4547 1.5162 1.3185 1.5427 1.5476 2.4567 1.3377 2.5773 4.7773 1.2113 1.2294 1.2959 3.0332 1.3413 1.2436 1.0654 1.1170 1.0571 1.0973 1.1229 1.1288 1.5175 7.2703 6.7390 1.0380 1.0380 1.0557 1.0441 1.0792 1.0676 1.0949 1.0960 1.0955 1.1038 1.1000 1.1000 1.0989 1.0994 1.0908 1.0918
irintensity: 0.4494 0.0513 1.3269 0.1530 5.3956 0.4117 0.0620 0.1573 0.4303 0.9881 0.7579 0.7037 0.3214 0.2774 0.0481 0.9092 4.0475 0.5318 3.2815 1.4782 2.4090 1.8858 23.4921 1.1644 1.6549 1.7320 3.9435 1.6212 2.8955 2.5031 2.1196 7.7826 2.8660 19.7523 4.2121 5.7217 0.4183 3.1934 1.1590 0.1221 0.5397 0.2140 0.6010 2.6495 1.0002 3.1816 1.5363 13.2215 13.8105 8.4284 0.6471 3.3909 1.3192 16.2183 13.6064 14.5052 3.0443 25.5222 6.5486 27.2452 12.7427 15.5839 33.5384 37.1690 47.6337 40.2180 13.5544 57.3285 31.6822 21.7474 25.5394 38.5237 57.8411 50.2931 14.0035 19.1426 29.4759 17.2774
temp: 298.150 k
press: 1.00000 atm
elementType: 6 6 6 6 6 6 6 6 6 6 6 6 1 1 1 1 1 1 1 1 1 1 1 1 1 1 1 1
symmnumber: 1
zpe: 638425.3 jmol-1
zpe.correction: 0.243163 hartree
zpe.thermalcorrener: 0.255351 hartree
zpe.thermalcorrenthalpy: 0.256296 hartree
zpe.thermalcorrgfe: 0.204769 hartree
zpe.sumelectzpe: -465.995660 hartree
zpe.sumelectthermal: -465.983472 hartree
zpe.sumelectthermalent: -465.982528 hartree
zpe.sumelectthermalfe: -466.034055 hartree
dipole: 0.3358 0.1313 0.0689
dipole: 0.3671
quadrupole: -68.2464 -68.5430 -75.7172
quadrupole: -0.1351 -0.8235 -0.6369
quadrupole: 2.5891 2.2926 -4.8817 -0.1351 -0.8235 -0.6369
hfenergy: -466.2388237 hartree
pointgroup: C01 [X(C12H16)]
dipole: -0.1309691 0.054348 -0.0274353 debye
polarizability: 158.6281747|-1.0439991|136.6025706|-2.3221161|2.5511027|81.0468395 unknown
InChI: InChI=1S/C12H16/c1-8-6-10(3)12-9(2)4-5-11(12)7-8/h6-7,9H,4-5H2,1-3H3
charge 0 multiplicity 1
28 atoms
C  -2.079445 0.328843 0.23775
C  -2.449422 -1.147821 0.603061
C  -0.551647 0.270917 0.157188
C  -1.296969 -2.023656 0.020503
C  -0.109107 -1.06859 0.016722
C  0.380151 1.338796 0.182254
C  -2.714613 0.782142 -1.104595
C  1.261168 -1.369998 -0.106312
C  2.21581 -0.320023 -0.083088
C  1.757266 1.014659 0.068755
C  -0.061909 2.785098 0.331553
C  3.700911 -0.612697 -0.228031
H  -2.419044 1.025115 1.030264
H  -3.443914 -1.437363 0.218183
H  -2.465975 -1.258414 1.703867
H  -1.530553 -2.355188 -1.011873
H  -1.115444 -2.936813 0.615976
H  -2.42499 0.100968 -1.926251
H  -3.818567 0.78785 -1.034266
H  -2.386587 1.800448 -1.382339
H  1.597562 -2.409834 -0.206927
H  2.49595 1.826886 0.105727
H  -0.466308 3.184273 -0.619122
H  -0.859314 2.892633 1.09012
H  0.782011 3.432012 0.628325
H  3.931586 -1.663017 0.02291
H  4.044083 -0.438279 -1.266728
H  4.308412 0.036353 0.428574
