program: Gaussian 09
title: 000005864
version: EM64L-G09RevD.01
frameworkgroup: C1[X(C21H34O5)]
method: RPBEPBE
basis: SDD
operation: Freq
keyword: #pfreq=noraman
keyword: PBEPBE/SDD
title: #p freq=noraman PBEPBE/SDD
converged: NO YES NO NO
title: Mulliken charges:
elementType: O O O O O C C C C C C C C C C C C C C C C C C C C C H H H H H H H H H H H H H H H H H H H H H H H H H H H H H H H H H H
charge: -0.453993 -0.463362 -0.443357 -0.233212 -0.447327 -0.125429 -0.176552 -0.119991 0.373040 0.358218 -0.056780 -0.183483 -0.638769 0.136046 -0.501712 -0.554387 -0.491711 -0.540878 -0.526481 -0.537885 -0.840413 -0.796126 -0.440445 -0.059317 0.041852 -0.358271 0.209773 0.259018 0.251525 0.189140 0.208381 0.267884 0.206507 0.214747 0.207862 0.221946 0.245057 0.191577 0.217938 0.274228 0.209408 0.229874 0.200108 0.231893 0.180824 0.237829 0.215615 0.278699 0.214731 0.264245 0.192846 0.213591 0.214349 0.179532 0.338931 0.339759 0.251157 0.228245 0.327455 0.366050
chargesum: 0.00000
title: Mulliken charges with hydrogens summed into heavy atoms:
elementType: O O O O O C C C C C C C C C C C C C C C C C C C C C
charge: -0.115062 -0.123603 -0.115903 -0.233212 -0.081277 0.084344 0.082466 0.131534 0.373040 0.358218 0.132361 0.024898 -0.164378 0.136046 -0.079103 -0.087384 -0.082196 -0.057242 -0.096500 -0.125168 -0.108269 -0.124304 -0.012504 0.120215 0.041852 0.121131
polarizability: 2.72605201e+02 4.48163151e+00 2.18181067e+02 -5.16238108e+00 -1.08052892e+00 2.05004786e+02
1716.lowfreq: -20.7435 -4.7391 0.0003 0.0005 0.0006 4.3209 26.8646 37.8329 51.1927
frequency: 25.9230 37.7865 51.1259 68.9528 79.4615 109.6669 126.5066 133.9762 146.6703 168.4220 174.5949 189.6911 211.8811 216.4997 225.8875 244.7599 251.0833 261.9981 267.6101 274.2096 287.9544 290.1368 313.5612 313.6260 320.6627 328.5520 329.3688 334.6260 357.8787 368.4196 379.6314 387.1394 402.9446 404.5159 424.3123 451.9315 458.2816 460.4280 468.0697 476.9106 507.6999 530.6572 538.9712 576.5770 586.3528 609.1069 626.2998 661.2408 729.0524 742.3127 754.0086 776.5296 787.7029 800.2696 821.1915 838.2257 849.7519 861.2578 894.2449 902.9429 908.4404 912.5581 919.0808 931.7463 945.2059 949.9422 968.0062 982.3618 986.5786 996.8544 1007.9051 1016.5094 1021.1083 1024.7590 1028.7374 1043.1782 1044.2696 1059.1816 1066.0226 1072.4961 1093.3154 1097.7049 1101.3202 1112.0492 1119.3968 1131.6928 1137.7102 1145.2070 1160.5344 1162.8895 1169.8531 1175.8603 1190.8488 1196.0664 1207.4767 1208.9523 1225.5218 1237.2874 1242.7318 1243.9595 1248.7486 1254.9047 1267.3759 1275.0503 1278.8503 1284.7599 1285.3328 1301.0299 1302.4949 1312.4728 1314.3033 1322.1627 1325.7170 1330.7542 1337.7681 1341.2027 1347.1196 1350.0877 1351.5668 1357.2624 1369.0971 1380.8370 1383.3972 1391.5746 1399.3706 1407.9622 1430.9016 1458.6019 1463.1248 1464.8893 1465.6448 1468.0198 1470.6019 1475.6537 1478.7935 1482.5721 1486.6957 1496.5475 1497.8461 1592.7630 2920.6882 2933.4572 2936.2193 2942.8010 2944.5872 2952.1860 2954.8683 2959.4073 2966.0699 2972.2517 2975.5685 2979.8807 2989.3189 2991.1034 2993.3447 2996.0287 3002.4137 3015.9266 3018.1881 3029.3092 3034.4960 3040.1540 3041.7153 3052.1674 3057.8344 3067.5451 3073.2766 3079.0037 3112.5709 3115.3455 3416.6512 3548.5730 3549.2946 3562.0402
redmass: 5.2674 5.2047 8.0087 4.8329 4.2321 2.6036 2.9764 3.5670 2.5877 3.1275 2.4560 1.8038 4.3768 2.9770 3.3607 2.4901 3.0139 1.3237 1.2158 2.1945 2.0765 3.0749 2.3320 1.3514 1.1943 3.7885 3.5446 3.0476 3.0768 2.7666 2.8246 3.1849 1.6552 2.8637 2.8695 2.6347 2.0412 2.8151 2.0567 2.4819 3.4021 3.1584 4.2061 2.7327 3.0128 2.8996 3.4489 2.8582 3.6063 2.8789 4.3980 2.6210 1.9924 2.1295 2.3081 2.6289 2.4329 2.4836 2.3042 2.5964 2.0695 1.8838 2.1763 2.0700 1.7572 1.9319 2.3753 2.3589 2.9452 2.7398 2.6236 1.9748 2.9240 2.0070 1.7820 2.1212 2.2441 2.4948 1.9897 2.3314 1.8863 1.8550 1.5403 1.6874 2.0528 2.0381 1.8042 1.4288 2.2356 1.7661 1.3284 1.8021 1.9089 1.6524 1.2687 1.6262 1.7315 1.4174 1.4623 1.4008 1.4766 1.3296 1.5590 1.5465 1.4280 1.4728 1.3293 1.5469 1.3419 1.3907 1.3817 1.3715 1.4323 1.3852 1.4090 1.4339 1.4491 1.4310 1.3811 1.3126 1.3838 1.3709 1.4672 1.2595 1.6027 1.1922 1.0801 1.0705 1.0648 1.0817 1.0834 1.0819 1.0811 1.0747 1.0810 1.0938 1.0759 1.0594 1.0579 8.0981 1.0836 1.0789 1.0816 1.0781 1.0772 1.0635 1.0765 1.0642 1.0665 1.0623 1.0524 1.0540 1.0643 1.0621 1.0409 1.0814 1.0655 1.0960 1.0958 1.0976 1.0988 1.0926 1.0926 1.1017 1.0975 1.0943 1.0993 1.0965 1.0965 1.0989 1.0641 1.0657 1.0659 1.0663
irintensity: 0.4114 0.7241 1.3123 2.0886 2.3383 6.2599 2.5456 1.1116 0.5560 0.0808 1.0096 1.8648 0.6787 9.0083 5.7571 5.3309 2.4418 11.4979 94.6920 24.8301 21.5782 4.1782 12.3677 91.6539 169.1088 21.2069 3.5576 15.6529 4.5593 1.8964 2.4641 6.5756 43.3929 17.8308 3.1894 7.3623 7.3944 6.9154 47.5186 5.3159 2.5606 9.4268 3.7233 0.7681 9.5650 2.0673 18.8769 5.4583 4.1677 0.6485 2.3375 1.5082 3.6584 9.4521 3.7405 6.7392 8.6131 14.1137 21.5713 49.0202 3.7641 12.7087 2.9593 17.3838 15.6901 1.4588 21.4300 2.4734 61.9629 37.5259 31.8802 11.8349 18.6611 6.5841 27.4661 5.3154 24.9584 16.5848 0.0510 53.9623 26.3038 11.9051 1.5367 16.2166 15.6811 1.6246 15.5178 8.6972 15.7998 13.8778 3.2101 8.1074 1.6427 27.1361 4.1995 10.5883 0.8784 16.1936 14.0293 108.8092 32.2776 6.8759 7.8324 14.3747 11.9138 24.2114 6.6019 1.0532 4.0211 10.8084 7.1517 2.2362 9.0729 2.5543 10.5036 4.8566 5.7991 9.3062 9.2081 8.7150 1.1130 67.1120 9.2125 22.1951 6.8874 29.9527 22.4874 0.8882 10.8271 6.0748 12.6365 3.1044 14.3285 20.7168 21.7112 4.7049 1.3865 9.2172 9.5042 75.2589 39.2528 14.3456 35.2687 6.9192 30.5763 16.6592 73.1326 44.5572 29.9216 30.2253 22.9075 112.3625 31.5228 22.1377 15.9555 32.2459 16.5332 18.4931 39.0185 45.9077 67.5848 40.5006 13.9360 67.2999 13.8025 58.7624 30.9778 20.8969 12.3571 7.4258 22.4910 4.1868 2.3888 6.1335
temp: 298.150 k
press: 1.00000 atm
elementType: 8 8 8 8 8 6 6 6 6 6 6 6 6 6 6 6 6 6 6 6 6 6 6 6 6 6 1 1 1 1 1 1 1 1 1 1 1 1 1 1 1 1 1 1 1 1 1 1 1 1 1 1 1 1 1 1 1 1 1 1
symmnumber: 1
zpe: 1363405.0 jmol-1
zpe.correction: 0.519294 hartree
zpe.thermalcorrener: 0.545277 hartree
zpe.thermalcorrenthalpy: 0.546221 hartree
zpe.thermalcorrgfe: 0.466292 hartree
zpe.sumelectzpe: -1194.667677 hartree
zpe.sumelectthermal: -1194.641694 hartree
zpe.sumelectthermalent: -1194.640750 hartree
zpe.sumelectthermalfe: -1194.720679 hartree
dipole: 2.2291 3.1673 -1.4650
dipole: 4.1408
quadrupole: -175.3572 -162.9953 -157.4665
quadrupole: -2.0153 6.9130 -10.7229
quadrupole: -10.0842 2.2777 7.8065 -2.0153 6.9130 -10.7229
hfenergy: -1195.1869707 hartree
pointgroup: C01 [X(C21H34O5)]
dipole: -0.8454544 1.3484868 0.3476449 debye
polarizability: 272.3459704|-6.6421489|218.4486264|-4.0459418|-1.1593974|204.9964575 unknown
InChI: InChI=1S/C21H34O5/c1-19-7-5-13(23)9-12(19)3-4-14-15-6-8-21(26,17(25)11-22)20(15,2)10-16(24)18(14)19/h12-16,18,22-24,26H,3-11H2,1-2H3
charge 0 multiplicity 1
60 atoms
O  -0.211901 -1.678547 -2.08316
O  2.559436 -0.012702 2.070396
O  -4.823176 -0.890184 2.77684
O  5.087289 0.140534 -0.501883
O  5.748394 -2.2671 0.454387
C  -1.257187 -0.213902 -0.374451
C  -0.561749 1.161444 -0.6463
C  0.772281 1.194219 0.129269
C  1.752155 0.040697 -0.258282
C  -2.696031 -0.30931 -1.017631
C  -3.571128 0.868908 -0.443864
C  -0.33487 -1.438676 -0.622733
C  1.06192 -1.306673 0.048028
C  2.963659 0.411512 0.70618
C  -1.470165 2.330274 -0.177062
C  1.656513 2.463432 0.085915
C  -2.914155 2.245338 -0.719864
C  3.054392 1.966594 0.586727
C  -3.401112 -1.656042 -0.660512
C  -3.922275 0.687764 1.060149
C  2.226379 0.118202 -1.733469
C  -2.677056 -0.202094 -2.569642
C  -3.731163 -1.832649 0.838925
C  -4.600002 -0.669536 1.332637
C  4.266111 -0.307302 0.35062
C  4.5779 -1.641808 1.032331
H  -1.408266 -0.240487 0.728004
H  -0.365228 1.271695 -1.731233
H  0.51638 1.018093 1.197542
H  -4.533731 0.836149 -1.00172
H  -0.821598 -2.332317 -0.174374
H  0.933594 -1.397889 1.142834
H  1.686856 -2.166258 -0.277683
H  -1.017334 3.294157 -0.480844
H  -1.490399 2.333144 0.933271
H  1.254295 3.270863 0.721627
H  1.728098 2.860506 -0.94376
H  -3.529236 3.048915 -0.266321
H  -2.907289 2.434505 -1.810418
H  3.863021 2.232362 -0.115169
H  3.321464 2.40864 1.566779
H  -2.793932 -2.504723 -1.025415
H  -4.349685 -1.695835 -1.23663
H  -3.024331 0.755939 1.703213
H  -4.597289 1.51461 1.368617
H  2.806028 1.032983 -1.942858
H  2.88209 -0.737562 -1.97966
H  1.361459 0.075209 -2.412451
H  -2.105866 0.668638 -2.933678
H  -2.217042 -1.097831 -3.013502
H  -3.714132 -0.103599 -2.947118
H  -4.268033 -2.784928 1.006001
H  -2.813686 -1.870877 1.45745
H  -5.576884 -0.693729 0.795665
H  0.48337 -2.371077 -2.222113
H  3.006164 0.576585 2.729305
H  3.703024 -2.315892 0.947744
H  4.729603 -1.46084 2.116533
H  -5.363831 -0.138951 3.131972
H  6.133887 -1.613292 -0.196758
