program: Gaussian 09
title: 000037470
version: EM64L-G09RevD.01
frameworkgroup: C1[X(C8H8O3S)]
method: RPBEPBE
basis: SDD
operation: Freq
keyword: #pfreq=noraman
keyword: PBEPBE/SDD
title: #p freq=noraman PBEPBE/SDD
converged: YES YES NO NO
title: Mulliken charges:
elementType: S O O O C C C C C C C C H H H H H H H H
charge: 0.209497 -0.410204 -0.410474 -0.215963 -0.397393 0.341738 -0.217430 -0.328365 -0.246777 -0.706446 -0.189966 0.246700 0.252549 0.255655 0.307125 0.305875 0.233176 0.232209 0.352050 0.386445
chargesum: 0.00000
title: Mulliken charges with hydrogens summed into heavy atoms:
elementType: S O O O C C C C C C C C
charge: 0.209497 -0.058154 -0.024029 -0.215963 -0.397393 0.341738 0.035119 -0.072710 -0.013601 -0.093447 0.042243 0.246700
polarizability: 1.54036279e+02 -6.48242087e+00 1.00878010e+02 1.26141095e+01 1.61964245e+00 7.81214441e+01
1716.lowfreq: -9.9174 0.0014 0.0019 0.0024 3.9526 10.7031 22.5966 26.6631 61.4825
frequency: 22.4894 26.0837 61.4340 73.3193 162.6824 176.8970 249.9120 272.4706 352.4691 381.7268 456.3162 471.5727 498.4212 537.5418 540.6372 564.1705 623.1251 629.6549 660.5367 716.5549 747.2649 763.8840 811.0854 862.8416 868.5776 894.5712 947.3950 982.9825 1013.4896 1032.8519 1045.3236 1114.4919 1142.7140 1165.7894 1184.4878 1226.2438 1231.5724 1308.0882 1319.0715 1389.3301 1424.9991 1446.0519 1453.0014 1585.2177 1604.9534 1672.5012 3037.4192 3106.2867 3135.8804 3146.5971 3165.2739 3176.9497 3349.9254 3515.1269
redmass: 11.7805 6.2126 6.1400 2.7088 7.5596 5.9231 7.7860 5.3984 7.7341 8.9703 3.3308 5.0949 1.8065 3.6712 7.8514 4.6534 1.0873 1.3512 6.7784 3.8837 5.5283 1.2991 6.2035 1.5794 3.6251 1.7226 1.3670 1.3202 4.6322 2.3273 2.2298 1.6191 1.1543 1.0655 1.4153 1.5489 1.7401 1.6137 2.1085 4.9353 1.1056 2.3509 2.7107 6.0534 6.5202 8.8973 1.0582 1.1045 1.0857 1.0909 1.0956 1.0993 1.0639 1.0641
irintensity: 0.6302 0.2985 0.5044 3.3632 3.3552 0.6854 5.6166 1.1415 6.3680 15.7404 13.6336 8.6611 33.4762 5.0533 1.0903 47.3064 118.7087 129.7305 6.1996 2.0090 6.9903 97.4246 17.2220 0.1396 4.7210 6.7869 2.7117 0.1965 15.1232 5.0469 327.6057 0.5642 1.7532 0.5145 183.0760 11.9546 5.0776 13.6624 63.3260 20.2214 38.5238 0.6803 87.1011 23.3239 17.9726 208.2017 9.7050 0.5645 2.0558 8.8446 16.5083 12.3335 87.2378 26.5301
temp: 298.150 k
press: 1.00000 atm
elementType: 16 8 8 8 6 6 6 6 6 6 6 6 1 1 1 1 1 1 1 1
symmnumber: 1
zpe: 378918.7 jmol-1
zpe.correction: 0.144323 hartree
zpe.thermalcorrener: 0.156002 hartree
zpe.thermalcorrenthalpy: 0.156946 hartree
zpe.thermalcorrgfe: 0.103886 hartree
zpe.sumelectzpe: -932.500255 hartree
zpe.sumelectthermal: -932.488576 hartree
zpe.sumelectthermalent: -932.487631 hartree
zpe.sumelectthermalfe: -932.540691 hartree
dipole: 0.0255 -1.6633 2.2770
dipole: 2.8199
quadrupole: -65.3045 -75.9917 -82.7119
quadrupole: -2.3864 -5.4422 0.3905
quadrupole: 9.3649 -1.3223 -8.0426 -2.3864 -5.4422 0.3905
hfenergy: -932.6445771 hartree
pointgroup: C01 [X(C8H8O3S1)]
dipole: 0.0559733 0.8011721 0.7654063 debye
dipolederiv: 0.0793293 -0.0237422 -0.0187017 -0.1327723 -0.1619255 0.0695694 -0.0969788 0.0883634 0.1225555 -0.5298594 0.3349106 -0.0910265 0.3436057 -1.07596 -0.0016694 -0.0833793 0.0759109 -0.3096312 -0.8247067 -0.170261 -0.5142383 -0.155864 -0.4350498 -0.1051378 -0.5385118 -0.1192329 -0.912841 -0.7688799 0.1582764 0.1834693 0.0684519 -0.4053324 -0.2413053 -0.0828235 -0.1916916 -0.7578403 0.2785127 -0.1580695 -0.0964426 0.1559047 -0.2286201 -0.056219 -0.0821033 0.0645833 -0.1852376 0.180916 -0.4597124 0.0771683 -0.2762425 0.9063535 -0.0507873 0.0668302 -0.0258263 0.0592141 0.0048666 0.0745142 -0.0903374 -0.2218179 0.047808 0.0089123 -0.0009783 -0.0839818 -0.0439765 -0.1335425 0.3035988 -0.1046476 -0.0193717 -0.1376347 -0.0157595 -0.02308 -0.1613354 -0.1173064 -0.2570761 -0.1238699 0.0351301 -0.0657809 -0.035592 -0.0289886 0.0382586 0.0047137 -0.1987788 -0.3333856 0.1250086 0.1642487 0.2333914 0.061642 -0.0377805 0.4300021 -0.0595556 0.051173 0.1156305 -0.0606399 -0.1082019 0.0715788 0.1520382 -0.095352 -0.1292085 -0.061843 -0.052684 1.530438 -0.1148894 0.2747395 -0.1473035 0.4131806 0.4091895 0.2521506 0.41632 1.2781469 0.0742034 -0.0730656 0.0674775 -0.0489293 0.0248503 0.0558323 0.0609103 0.0642898 0.0998532 0.0493913 -0.0368681 0.0579645 -0.0490097 0.0106435 0.0699595 0.0717464 0.0660656 0.125361 0.0552069 -0.0289649 -0.0091714 -0.0250895 0.0699184 0.0438999 -0.0315419 0.0285097 -0.0246156 0.0514627 0.0040162 -0.0497425 -0.0127497 -0.0091481 -0.0492437 -0.0879622 -0.0464541 0.0407762 0.0372502 0.0849432 0.0244929 0.0979726 -0.0673579 0.0407046 0.0295746 0.0408484 0.1483994 -0.0834476 0.0400012 0.0902955 0.0410442 0.0943765 0.0031381 0.0982044 0.0022758 0.1125648 0.3223729 0.0480674 0.0502521 0.0468369 0.4241022 0.035349 0.0075674 -0.041014 0.2589693 0.1513174 0.0767463 0.0572715 0.096145 0.3517071 -0.0543115 0.1013231 -0.060946 0.3058981 unknown
polarizability: 152.2199073|-13.5384673|101.693066|-10.7771856|-4.6023424|79.1227598 unknown
InChI: InChI=1S/C8H8O3S/c9-6-3-1-2-4-7(6)12-5-8(10)11/h1-4,9-10H,5H2
charge 0 multiplicity 1
20 atoms
S  0.882053 -0.116719 -1.227859
O  -0.974664 -2.070958 0.225697
O  4.009076 0.21599 1.364766
O  3.832848 -0.679584 -0.776503
C  -0.803741 0.256531 -0.564106
C  -1.518947 -0.795087 0.077438
C  -1.395872 1.529768 -0.70886
C  -2.813484 -0.554136 0.594699
C  -2.691258 1.769921 -0.197965
C  1.840622 0.24346 0.374364
C  -3.389644 0.72511 0.456588
C  3.297754 -0.135784 0.209725
H  -0.841273 2.321949 -1.222767
H  -3.343949 -1.375254 1.085455
H  1.393745 -0.328694 1.204765
H  1.754723 1.315882 0.61164
H  -3.150205 2.757103 -0.310983
H  -4.393885 0.906041 0.85546
H  -0.119934 -2.109078 -0.297056
H  4.965134 -0.041561 1.257502
