program: ADF
programVersion: 2019
title: Hydrogen (TZ2P)
runtype: SINGLE POINT
method: DFT
functional: PBE0 == Not Default ==
basis: TZ2P
formula: C16H14N2O8Ru
InChI: InChI=1S/2C6H7N.2C2O4.Ru/c2*1-6-2-4-7-5-3-6;2*3-1(4)2(5)6;/h2*2-5H,1H3;;;/q2*-1;2*-2;+6
41 atoms
Ru 0.0000 0.0000 0.0000
O  -0.0299 1.2786 -1.5546
O  -0.0135 -1.2921 -1.5443
O  -0.0621 1.3922 -3.7781
O  -0.0453 -1.4237 -3.7669
O  0.0127 1.2938 1.5423
O  0.0304 -1.2769 1.5566
O  0.0387 1.4289 3.7646
O  0.0625 -1.3868 3.7803
N  2.0674 0.0138 -0.0296
N  -2.0674 -0.0141 0.0293
C  -0.0435 0.7655 -2.7350
C  -0.0339 -0.7887 -2.7288
C  0.0309 0.7922 2.7275
C  0.0430 -0.7620 2.7361
C  2.7474 1.1645 -0.0369
H  2.1574 2.0714 -0.0253
C  4.1275 1.2100 -0.0575
H  4.6229 2.1728 -0.0620
C  4.8632 0.0299 -0.0718
C  6.3556 0.0304 -0.0983
C  4.1397 -1.1613 -0.0631
H  4.6450 -2.1190 -0.0721
C  2.7621 -1.1313 -0.0424
H  2.1814 -2.0443 -0.0355
C  -2.7630 1.1272 0.0324
H  -2.1855 2.0422 0.0182
C  -4.1436 1.1541 0.0524
H  -4.6520 2.1101 0.0539
C  -4.8633 -0.0358 0.0704
C  -6.3556 -0.0555 0.0934
C  -4.1236 -1.2171 0.0667
H  -4.6159 -2.1816 0.0797
C  -2.7465 -1.1685 0.0463
H  -2.1535 -2.0735 0.0432
H  6.7550 1.0428 -0.0567
H  6.7214 -0.4488 -1.0096
H  6.7556 -0.5376 0.7444
H  -6.7680 0.9524 0.0862
H  -6.7181 -0.5729 0.9846
H  -6.7453 -0.5970 -0.7716
spinMolecule: Restricted
epsl: 78.39000
energy: -8.697 -8.356 -8.270 -8.046 -8.019 -7.946 -7.889 -7.597 -6.438 -6.108 -5.169 -1.340 -1.181 -1.120 -0.818 -0.710 -0.637 -0.152 0.436 0.549 0.841 electronvolt
elementType: Ru O O O O O O O O N N C C C C C H C H C C C H C H C H C H C C C H C H H H H H H H
charge: 1.4679 -0.6904 -0.6906 -0.6872 -0.6873 -0.6906 -0.6904 -0.6872 -0.6873 -0.5222 -0.5222 0.6806 0.6808 0.6807 0.6807 0.4408 -0.1592 0.1682 -0.1786 0.1614 0.4442 0.1864 -0.1712 0.4421 -0.1600 0.4408 -0.1592 0.1681 -0.1786 0.1615 0.4443 0.1864 -0.1712 0.4421 -0.1600 -0.1886 -0.1499 -0.1533 -0.1887 -0.1512 -0.1518
mdcq: 1.455613 -0.627183 -0.644726 -0.650289 -0.639756 -0.626268 -0.643248 -0.640774 -0.640208 -0.271051 -0.269755 0.567717 0.560343 0.549022 0.565072 0.040465 0.119941 -0.164887 0.156964 0.016537 0.171391 -0.156895 0.156299 0.034541 0.124339 0.039851 0.119130 -0.171959 0.164520 0.044315 0.064186 -0.158564 0.154504 0.035792 0.123678 -0.014816 -0.002575 -0.003053 0.006769 0.027071 0.027951
quadrupole: 112.08628155 0.73598572 -3.32515829 3.64627086 -0.51895629 -115.73255241
eener: -249.2540 electronvolt
kinener: 323.3200 electronvolt
coulombener: -73.0541 electronvolt
xcener: -345.9454 electronvolt
solvener: -3.6557 electronvolt
total: -348.5891 electronvolt
mo.energy: -23.522 electronvolt
energy: -15.871 -15.871 -15.871 -15.871 -15.871 -15.871 -15.871 -15.871 -21.259 -21.259 -5.048 -5.048 -5.048 -5.048 -5.048 -5.048 5.519 5.519 electronvolt
mo.energy: -23.492 electronvolt
energy: -15.871 -15.871 -15.871 -15.871 -15.871 -15.871 -15.871 -15.871 -21.259 -21.259 -5.048 -5.048 -5.048 -5.048 -5.048 -5.048 5.519 5.519 -5.048 -5.048 electronvolt
mo.energy: -21.949 electronvolt
energy: -15.871 -15.871 -15.871 -15.871 -15.871 -15.871 -15.871 -15.871 -7.353 -7.353 -6.582 -6.582 -6.582 -6.582 -6.582 -6.582 -6.582 -6.582 5.519 5.519 -5.048 -5.048 electronvolt
mo.energy: -21.941 electronvolt
energy: -15.871 -15.871 -15.871 -15.871 -15.871 -15.871 -15.871 -15.871 -7.353 -7.353 -6.582 -6.582 -6.582 -6.582 -6.582 -6.582 -6.582 -6.582 -5.048 -5.048 5.519 5.519 electronvolt
mo.energy: -20.284 electronvolt
energy: -15.871 -15.871 -6.582 -6.582 -6.582 -6.582 -6.582 -6.582 -5.048 -5.048 -15.871 -15.871 -15.871 -15.871 -21.259 -21.259 5.519 5.519 -5.048 -5.048 -5.048 -5.048 -5.048 -5.048 -5.048 -5.048 -15.871 -15.871 electronvolt
mo.energy: -20.247 electronvolt
energy: -15.871 -15.871 -6.582 -6.582 -6.582 -6.582 -6.582 -6.582 -5.048 -5.048 -15.871 -15.871 -15.871 -15.871 -21.259 -21.259 5.519 5.519 -5.048 -5.048 -5.048 -5.048 -5.048 -5.048 -5.048 -5.048 electronvolt
mo.energy: -18.382 electronvolt
energy: -7.353 -7.353 -5.048 -5.048 -15.871 -15.871 -15.871 -15.871 -6.582 -6.582 -6.582 -6.582 -5.048 -5.048 -5.048 -5.048 -15.871 -15.871 -15.871 -15.871 -6.582 -6.582 -6.582 -6.582 electronvolt
mo.energy: -18.364 electronvolt
energy: -5.048 -5.048 -5.048 -5.048 -15.871 -15.871 -15.871 -15.871 -27.198 -27.198 -27.198 -27.198 -9.955 -9.955 -9.955 -9.955 -27.198 -27.198 -27.198 -27.198 -9.955 -9.955 -9.955 -9.955 5.845 -9.955 -9.955 -9.955 -9.955 electronvolt
mo.energy: -18.352 electronvolt
mo.energy: -18.240 electronvolt
energy: -5.048 -5.048 -5.048 -5.048 -15.871 -15.871 -15.871 -15.871 -27.198 -27.198 -27.198 -27.198 -9.955 -9.955 -9.955 -9.955 -27.198 -27.198 -27.198 -27.198 -9.955 -9.955 -9.955 -9.955 electronvolt
mo.energy: -17.306 electronvolt
energy: -15.871 -15.871 -5.048 -5.048 -5.048 -15.871 -5.048 -15.871 -15.871 -15.871 -15.871 -15.871 -6.582 -6.582 -6.582 -6.582 -5.048 -5.048 -5.048 -5.048 -5.048 -5.048 -5.048 -5.048 -6.582 -6.582 -6.582 -6.582 -6.582 -6.582 -21.259 -21.259 -5.048 -5.048 electronvolt
mo.energy: -17.284 electronvolt
energy: -15.871 -15.871 -5.048 -5.048 -5.048 -5.048 -15.871 -15.871 -15.871 -15.871 -15.871 -15.871 -6.582 -6.582 -6.582 -6.582 -5.048 -5.048 -5.048 -5.048 -5.048 -5.048 -5.048 -5.048 -6.582 -6.582 -6.582 -6.582 -6.582 -6.582 -21.259 -21.259 -5.048 -5.048 electronvolt
mo.energy: -15.620 electronvolt
energy: -9.955 -9.955 -9.955 -9.955 -5.965 -9.955 -9.955 -9.955 -9.955 -27.198 -27.198 -27.198 -27.198 -27.198 -27.198 -27.198 -27.198 -15.871 -15.871 -15.871 -15.871 electronvolt
mo.energy: -15.444 electronvolt
energy: -9.955 -9.955 -9.955 -9.955 -7.353 -7.353 -5.048 -5.048 -5.048 -5.048 -6.582 -6.582 -6.582 -6.582 -5.048 -5.048 -5.048 -5.048 -5.048 -5.048 -5.048 -5.048 electronvolt
mo.energy: -15.066 electronvolt
energy: -9.955 -9.955 -9.955 -9.955 -9.955 -9.955 -9.955 -9.955 -27.198 -27.198 -27.198 -27.198 -27.198 -27.198 -27.198 -27.198 -15.871 -15.871 -15.871 -15.871 0.324 electronvolt
mo.energy: -14.977 electronvolt
energy: -7.353 -7.353 -5.965 -9.955 -9.955 -9.955 -9.955 -5.965 -6.582 -6.582 -6.582 -6.582 -5.048 -5.048 -5.048 -5.048 -6.582 -6.582 -6.582 -6.582 -5.048 -5.048 -5.048 -5.048 -5.048 -5.048 -5.048 -5.048 -5.048 -5.048 -5.048 -5.048 -5.048 -5.048 -5.048 -9.955 electronvolt
mo.energy: -14.901 electronvolt
energy: -7.353 -7.353 -6.582 -6.582 -6.582 -6.582 -5.048 -5.048 -5.048 -5.048 -5.048 -5.048 -5.048 -5.048 -5.048 -5.048 -5.048 -5.048 -5.048 -5.048 -6.582 -6.582 -6.582 -6.582 -5.048 -5.048 -15.871 -5.048 -15.871 -5.048 -5.048 -5.048 -21.259 -21.259 -6.582 -6.582 -6.582 electronvolt
mo.energy: -14.427 electronvolt
energy: -5.048 -5.048 -7.353 -7.353 -5.048 -5.048 -5.048 -5.048 -5.048 -5.048 -5.048 -5.048 -5.048 -5.048 -5.048 -5.048 -5.048 -5.048 -6.582 -6.582 5.519 5.519 5.519 5.519 -5.965 electronvolt
mo.energy: -14.406 electronvolt
energy: -9.955 -9.955 -9.955 -9.955 -5.048 -5.048 -5.048 -5.048 -9.955 -9.955 -9.955 -9.955 0.324 -27.198 -27.198 -27.198 -27.198 electronvolt
mo.energy: -14.365 electronvolt
energy: -7.353 -7.353 -5.048 -5.048 -5.048 -5.048 -5.048 -5.048 -5.048 -5.048 -5.048 -5.048 -5.048 -5.048 -5.048 -5.048 -5.048 -5.048 5.519 5.519 5.519 -6.582 -6.582 5.519 electronvolt
mo.energy: -13.629 electronvolt
energy: -5.048 -5.048 -5.048 -5.048 -9.955 -9.955 -9.955 -9.955 -5.965 -9.955 -9.955 -9.955 -9.955 -7.353 -7.353 -5.048 -5.048 -5.048 -5.048 electronvolt
mo.energy: -13.609 electronvolt
energy: -9.955 -9.955 -9.955 -9.955 -9.955 -9.955 -9.955 -9.955 -27.198 -27.198 -27.198 -27.198 -9.955 -9.955 -9.955 -9.955 -5.965 -5.048 -5.048 -5.048 -5.048 5.519 5.519 5.519 5.519 -6.582 -6.582 -6.582 -6.582 electronvolt
mo.energy: -13.432 electronvolt
energy: -6.582 -6.582 -6.582 -6.582 -5.048 -5.048 -5.048 -5.048 -5.048 -5.048 -5.048 -5.048 -9.955 -9.955 -9.955 -9.955 -6.582 -6.582 -6.582 -6.582 -9.955 -9.955 -9.955 -9.955 -15.871 -15.871 -15.871 -15.871 electronvolt
mo.energy: -13.373 electronvolt
energy: -9.955 -9.955 -9.955 -9.955 -9.955 -9.955 -9.955 -9.955 -27.198 -27.198 -27.198 -27.198 -9.955 -9.955 -9.955 -9.955 -5.048 -5.048 -5.048 -5.048 5.519 5.519 5.519 5.519 -9.955 -9.955 -9.955 -9.955 electronvolt
mo.energy: -13.295 electronvolt
energy: -6.582 -6.582 -6.582 -6.582 -6.582 -6.582 -6.582 -6.582 -5.048 -5.048 -5.048 -5.048 -15.871 -15.871 -15.871 -15.871 -15.871 -15.871 -15.871 -15.871 -15.871 -15.871 -5.048 -5.048 -5.048 -5.048 -9.955 -9.955 electronvolt
mo.energy: -13.198 electronvolt
energy: -5.048 -5.048 -5.048 -5.048 -9.955 -9.955 -9.955 -9.955 -9.955 -9.955 -9.955 -9.955 -6.582 -6.582 -6.582 -6.582 -6.582 -6.582 -6.582 -6.582 electronvolt
mo.energy: -12.820 electronvolt
energy: -9.955 -9.955 -9.955 -9.955 -9.955 -9.955 -9.955 -9.955 -27.198 -27.198 -27.198 -27.198 -9.955 -9.955 -9.955 -9.955 -5.965 5.519 5.519 5.519 5.519 -5.048 -5.048 -5.048 -5.048 electronvolt
mo.energy: -12.789 electronvolt
energy: -9.955 -9.955 -9.955 -9.955 -9.955 -9.955 -9.955 -9.955 -9.955 -9.955 -9.955 -9.955 -27.198 -27.198 -27.198 -27.198 5.519 5.519 5.519 5.519 -5.048 -5.048 -5.048 -5.048 -9.955 -9.955 -9.955 -9.955 electronvolt
mo.energy: -12.490 electronvolt
energy: -6.582 -6.582 -6.582 -6.582 -5.048 -5.048 -5.048 -5.048 -5.048 -6.582 -6.582 -5.048 -5.048 -6.582 -6.582 -5.048 -5.048 -5.048 -5.048 -5.048 -5.048 -5.048 -9.955 -9.955 -9.955 -9.955 -5.048 -5.048 -5.965 electronvolt
mo.energy: -12.377 electronvolt
energy: -7.353 -7.353 -5.048 -5.048 -5.048 -5.048 -5.048 -5.048 -5.048 -5.048 -5.048 -5.048 -5.048 -5.048 -6.582 -6.582 -6.582 -6.582 electronvolt
mo.energy: -12.363 electronvolt
energy: -6.582 -6.582 -6.582 -6.582 -5.048 -5.048 -5.048 -5.048 -5.048 -5.048 -6.582 -6.582 -5.048 -5.048 -6.582 -6.582 -5.048 -5.048 -5.048 -5.048 -5.048 -5.048 -5.048 -5.048 electronvolt
mo.energy: -12.352 electronvolt
energy: -7.353 -7.353 -5.048 -5.048 -5.048 -5.048 -5.048 -5.048 -5.048 -5.048 -5.048 -5.048 -5.048 -5.048 -6.582 -6.582 -6.582 -6.582 -9.955 -9.955 -9.955 -9.955 -5.048 -5.048 -5.048 -5.048 electronvolt
mo.energy: -12.073 electronvolt
energy: -7.353 -7.353 -5.048 -5.048 -5.048 -5.048 -5.965 -5.965 5.519 5.519 -6.582 -6.582 -6.582 -6.582 -6.582 -6.582 electronvolt
mo.energy: -11.807 electronvolt
energy: -9.955 -9.955 -9.955 -9.955 -9.955 -9.955 -9.955 -9.955 -5.048 -5.048 -5.048 -5.048 -5.965 electronvolt
mo.energy: -11.763 electronvolt
energy: -9.955 -9.955 -9.955 -9.955 -9.955 -9.955 -9.955 -9.955 -5.048 -5.048 -5.048 -5.048 electronvolt
mo.energy: -11.609 electronvolt
energy: -5.048 -5.048 -7.353 -7.353 -6.582 -6.582 -6.582 -6.582 -5.048 -5.048 -5.965 -5.048 -5.048 -5.048 -5.048 -9.955 -9.955 -9.955 -9.955 electronvolt
mo.energy: -11.535 electronvolt
energy: -5.048 -5.048 -7.353 -7.353 -6.582 -6.582 -6.582 -6.582 -5.048 -5.048 -5.048 -5.048 -5.048 -5.048 electronvolt
mo.energy: -11.450 electronvolt
energy: -5.048 -5.048 -5.048 -5.048 -7.353 -7.353 5.519 5.519 -6.582 -6.582 -6.582 -6.582 -6.582 5.519 5.519 -6.582 electronvolt
mo.energy: -11.264 electronvolt
energy: -5.048 -5.048 -6.582 -6.582 -6.582 -6.582 -6.582 -6.582 -6.582 -6.582 -6.582 -6.582 -7.353 -7.353 -5.048 -5.048 -5.048 -5.048 -5.048 5.519 -5.048 5.519 electronvolt
mo.energy: -11.258 electronvolt
energy: -5.048 -5.048 -6.582 -6.582 -6.582 -6.582 -6.582 -6.582 -6.582 -6.582 -6.582 -6.582 -7.353 -7.353 -5.048 -5.048 -5.048 -5.048 5.519 -5.048 5.519 -5.048 electronvolt
mo.energy: -10.734 electronvolt
energy: -9.955 -9.955 -9.955 -9.955 -5.965 5.845 -9.955 -9.955 -9.955 -9.955 electronvolt
mo.energy: -10.476 electronvolt
energy: -5.965 -9.955 -9.955 -9.955 -9.955 -9.955 -9.955 -9.955 -9.955 -5.048 -5.048 -5.048 -5.048 -9.955 -9.955 -9.955 -9.955 electronvolt
mo.energy: -10.285 electronvolt
energy: -6.582 -6.582 -9.955 -9.955 -9.955 -9.955 -5.048 -5.048 -5.048 -5.048 -5.048 -5.048 -5.048 -5.048 -6.582 -6.582 -6.582 -6.582 -6.582 -6.582 -9.955 -9.955 -9.955 -9.955 -6.582 -6.582 5.519 5.519 -7.353 -7.353 electronvolt
mo.energy: -10.241 electronvolt
energy: -5.048 -5.048 -6.582 -6.582 -5.048 -5.048 -5.048 -5.048 -5.048 -5.048 -6.582 -6.582 -6.582 -6.582 -6.582 -6.582 -6.582 -6.582 5.519 5.519 -7.353 -7.353 -6.582 -6.582 -6.582 -5.048 -5.048 -5.048 -5.048 -6.582 electronvolt
mo.energy: -10.110 electronvolt
energy: -9.955 -9.955 -9.955 -9.955 -9.955 -9.955 -9.955 -9.955 -6.582 -6.582 -6.582 -6.582 -6.582 -6.582 -5.048 -5.048 -5.048 -5.048 electronvolt
mo.energy: -10.065 electronvolt
energy: -5.965 -7.353 -7.353 -5.048 -5.048 -5.048 -5.048 -5.048 -5.048 -5.048 -5.048 -5.048 -5.048 -5.048 -5.048 -6.582 -6.582 -6.582 -6.582 5.519 5.519 electronvolt
mo.energy: -9.718 electronvolt
energy: -5.965 -9.955 -9.955 -9.955 -9.955 -9.955 -9.955 -9.955 -9.955 -5.048 -5.048 -5.048 -5.048 -5.048 -5.048 -5.048 -5.048 -5.048 -5.048 electronvolt
mo.energy: -9.393 electronvolt
energy: -9.955 -9.955 -9.955 -9.955 -9.955 -9.955 -9.955 -9.955 -9.955 -9.955 -9.955 -9.955 -9.955 -9.955 -9.955 -9.955 19.825 electronvolt
mo.energy: -9.330 electronvolt
energy: -9.955 -9.955 -9.955 -9.955 -9.955 -9.955 -9.955 -9.955 -7.353 -7.353 0.324 -5.048 -5.048 -5.048 -5.048 -5.048 -5.048 -5.048 -5.048 -5.048 -5.048 electronvolt
mo.energy: -9.197 electronvolt
energy: -5.965 -9.955 -9.955 -9.955 -9.955 -9.955 -9.955 -9.955 -9.955 electronvolt
mo.energy: -8.811 electronvolt
energy: -9.955 -9.955 -9.955 -9.955 -9.955 -9.955 -9.955 -9.955 electronvolt
mo.energy: -8.727 electronvolt
energy: -7.353 -7.353 -9.955 -9.955 -9.955 -9.955 -9.955 -9.955 -9.955 -9.955 -21.259 -21.259 -5.048 -5.048 -5.048 -5.048 -5.048 -5.048 -5.048 -5.048 electronvolt
mo.energy: -8.697 electronvolt
energy: -9.955 -9.955 -9.955 -9.955 -9.955 -9.955 -9.955 -9.955 -5.965 -9.955 -9.955 -9.955 -9.955 electronvolt
mo.energy: -8.356 electronvolt
energy: -5.048 -5.048 -7.353 -7.353 -5.048 -5.048 -5.048 -5.048 -5.048 -5.048 -6.582 -6.582 -6.582 -6.582 electronvolt
mo.energy: -8.270 electronvolt
energy: -5.048 -5.048 -7.353 -7.353 -5.048 -5.048 -5.048 -5.048 -9.955 -9.955 -9.955 -9.955 -9.955 -9.955 -9.955 -9.955 -6.582 -5.048 -5.048 -6.582 -6.582 -6.582 electronvolt
mo.energy: -8.046 electronvolt
energy: -9.955 -9.955 -9.955 -9.955 -9.955 -9.955 -9.955 -9.955 -9.955 -9.955 -9.955 -9.955 -9.955 -9.955 -9.955 -9.955 electronvolt
mo.energy: -8.019 electronvolt
energy: -9.955 -9.955 -9.955 -9.955 -5.965 -5.965 -9.955 -9.955 -9.955 -9.955 -15.871 -15.871 -15.871 -15.871 -9.955 -9.955 -9.955 -9.955 -5.048 -5.048 -5.048 -5.048 electronvolt
mo.energy: -7.946 electronvolt
energy: -5.048 -5.048 -5.048 -5.048 -5.048 -5.048 -5.048 -5.048 electronvolt
mo.energy: -7.889 electronvolt
mo.energy: -7.597 electronvolt
energy: -9.955 -9.955 -9.955 -9.955 -9.955 -9.955 -9.955 -9.955 -5.048 -5.048 -5.048 -5.048 -15.871 -15.871 -15.871 -15.871 -9.955 -9.955 -9.955 -9.955 -9.955 -9.955 electronvolt
mo.energy: -6.438 electronvolt
mo.energy: -6.108 electronvolt
energy: -5.965 -9.955 -9.955 -9.955 -9.955 -5.048 -5.048 -9.955 -9.955 -9.955 -9.955 -5.048 -5.048 -5.048 -5.048 electronvolt
mo.energy: -5.169 electronvolt
energy: -5.965 -5.965 -9.955 -9.955 -9.955 -9.955 -9.955 -9.955 -9.955 -9.955 electronvolt
mo.energy: -1.340 electronvolt
energy: -5.048 -5.048 -7.353 -7.353 -5.048 -5.048 -5.048 -5.048 -5.048 -5.048 5.519 5.519 8.878 8.878 -5.048 -5.048 -6.582 -6.582 -6.582 -6.582 electronvolt
mo.energy: -1.181 electronvolt
energy: -5.048 -5.048 -7.353 -7.353 -5.048 -5.048 -5.048 -5.048 -5.048 -5.048 -5.048 -5.048 -5.048 -5.048 -9.955 -9.955 -9.955 -9.955 5.519 5.519 -9.955 -9.955 8.878 8.878 -9.955 -9.955 -5.048 -5.048 electronvolt
mo.energy: -1.120 electronvolt
energy: -5.048 -5.048 -5.048 -5.048 -9.955 -9.955 -9.955 -9.955 -9.955 -9.955 -9.955 -9.955 10.811 10.811 10.811 10.811 electronvolt
mo.energy: -0.818 electronvolt
energy: -5.048 -5.048 -5.048 -5.048 -5.048 -5.048 -9.955 -9.955 -5.965 -9.955 -9.955 -9.955 -9.955 -9.955 -9.955 -5.048 -5.048 -7.353 -7.353 -5.048 -5.048 5.519 5.519 electronvolt
mo.energy: -0.710 electronvolt
energy: -5.048 -5.048 -5.048 -5.048 -5.048 -5.048 -5.048 -5.048 5.519 -5.965 5.519 5.519 5.519 5.519 5.519 5.519 5.519 electronvolt
mo.energy: -0.637 electronvolt
energy: -5.048 -5.048 -5.048 -5.048 -5.048 -5.048 -5.048 -5.048 5.519 5.519 5.519 5.519 5.519 5.519 5.519 5.519 electronvolt
mo.energy: -0.152 electronvolt
energy: -5.965 -9.955 -9.955 5.845 -9.955 -9.955 -9.955 -9.955 -9.955 -9.955 electronvolt
mo.energy: 0.436 electronvolt
energy: -5.965 -5.965 -7.353 -7.353 5.845 -4.103 -21.259 -21.259 1.310 5.845 -6.582 -6.582 -6.582 -6.582 -6.582 -6.582 -6.582 -6.582 electronvolt
mo.energy: 0.549 electronvolt
energy: 1.310 -4.103 3.073 3.073 3.073 3.073 3.073 3.073 3.073 3.073 3.073 3.073 3.073 3.073 -6.582 -6.582 -6.582 -6.582 -6.582 -6.582 -6.582 -6.582 -6.582 -6.582 -6.582 -6.582 12.633 11.266 11.266 11.266 11.266 electronvolt
mo.energy: 0.841 electronvolt
energy: 3.073 3.073 3.073 3.073 3.073 3.073 3.073 3.073 3.073 3.073 -6.582 -6.582 -6.582 -6.582 0.324 -6.582 -6.582 -6.582 -6.582 -6.582 -6.582 5.519 5.519 5.519 5.519 -5.048 -5.048 5.519 5.519 11.266 11.266 11.266 11.266 5.519 5.519 11.266 11.266 5.519 5.519 electronvolt
mo.energy: 1.189 electronvolt
energy: 3.073 3.073 -6.582 -6.582 3.073 3.073 3.073 3.073 -6.582 -6.582 0.324 3.073 3.073 5.519 5.519 5.519 5.519 5.519 5.519 5.519 5.519 -6.582 -6.582 -6.582 -6.582 5.519 5.519 5.519 5.519 3.073 3.073 3.073 5.519 3.073 5.519 5.519 5.519 -6.582 -6.582 1.310 -6.582 -6.582 -5.048 -5.048 -4.103 electronvolt
mo.energy: 1.211 electronvolt
energy: 1.310 3.073 3.073 -4.103 3.073 3.073 3.073 3.073 5.519 3.073 3.073 5.519 -6.582 -6.582 -6.582 -6.582 -6.582 -6.582 -6.582 -6.582 5.519 5.519 5.519 5.519 5.519 5.519 -5.048 -5.048 3.073 3.073 5.519 5.519 11.266 11.266 5.519 5.519 5.519 5.519 5.845 -5.048 electronvolt
mo.energy: 1.544 electronvolt
energy: 3.073 3.073 3.073 3.073 -6.582 -6.582 5.519 5.519 -6.582 -6.582 5.519 5.519 5.519 5.519 3.073 3.073 3.073 3.073 3.073 3.073 -6.582 -6.582 5.519 5.519 -6.582 -6.582 -6.582 -6.582 -5.048 -5.048 3.073 3.073 3.073 3.073 5.519 5.845 5.519 -6.582 electronvolt
mo.energy: 1.724 electronvolt
energy: 5.519 5.519 -6.582 -6.582 3.073 3.073 3.073 3.073 3.073 3.073 3.073 3.073 -6.582 -6.582 3.073 3.073 3.073 3.073 -6.582 -6.582 -6.582 -6.582 -6.582 -6.582 5.519 5.519 -6.582 5.519 -6.582 5.519 -6.582 -6.582 0.324 3.073 3.073 -5.048 -5.048 5.519 5.519 11.266 11.266 11.266 11.266 -5.048 -5.048 5.519 5.519 5.519 5.519 electronvolt
mo.energy: 2.133 electronvolt
energy: -6.582 -6.582 3.073 3.073 5.519 5.519 5.519 5.519 3.073 3.073 -6.582 -6.582 3.073 3.073 -6.582 -6.582 5.519 5.519 3.073 3.073 5.519 5.519 5.519 5.519 3.073 3.073 -6.582 -6.582 0.324 5.519 5.519 3.073 3.073 3.073 3.073 -6.582 -6.582 -6.582 -6.582 5.519 5.519 -6.582 -6.582 5.519 5.519 1.310 5.519 -5.048 -5.048 5.519 -5.048 -5.048 electronvolt
mo.energy: 2.322 electronvolt
energy: -6.582 5.519 3.073 -6.582 -6.582 -6.582 3.073 -6.582 5.519 3.073 1.310 3.073 -6.582 -4.103 3.073 3.073 5.519 5.519 -5.048 -5.048 -6.582 5.519 -6.582 5.845 5.519 -5.965 -5.048 -7.353 5.519 -6.582 5.519 5.519 -5.048 5.519 -6.582 5.519 -5.048 3.073 -5.048 5.519 5.519 5.519 electronvolt
mo.energy: 2.335 electronvolt
energy: -6.582 -6.582 -6.582 5.519 1.310 3.073 -4.103 3.073 3.073 -6.582 5.519 3.073 5.519 -6.582 -6.582 -6.582 5.845 -5.965 -6.582 5.519 3.073 -6.582 5.519 -5.048 5.519 5.519 5.519 -5.048 3.073 5.519 5.519 5.519 3.073 -5.965 -7.353 5.519 5.519 3.073 electronvolt
mo.energy: 2.371 electronvolt
energy: -6.582 -6.582 5.519 -6.582 5.519 -6.582 3.073 3.073 3.073 3.073 -5.048 -5.048 -5.048 -5.048 5.519 5.519 -7.353 -7.353 5.519 5.519 -5.048 -5.048 5.519 5.519 5.519 -6.582 5.519 -5.048 electronvolt
mo.energy: 2.737 electronvolt
energy: -6.582 -6.582 5.519 5.519 3.073 3.073 -6.582 -6.582 3.073 3.073 -6.582 -6.582 5.519 -6.582 5.519 5.519 5.519 -5.048 -6.582 -5.048 -6.582 -6.582 -6.582 -6.582 3.073 3.073 3.073 5.519 5.519 5.519 5.519 3.073 -5.048 -5.048 3.073 5.845 -6.582 -6.582 43.500 43.500 5.519 -5.048 5.519 -5.048 5.519 5.519 electronvolt
mo.energy: 2.827 electronvolt
energy: 0.324 5.519 5.519 5.519 5.519 8.878 8.878 5.519 5.519 5.519 5.519 23.286 23.286 23.286 23.286 -5.048 -5.048 -5.048 -5.048 -5.048 -5.048 -5.048 -5.048 5.519 5.519 -5.048 -5.048 5.519 5.519 10.811 10.811 10.811 10.811 -5.048 -5.048 5.519 5.519 electronvolt
mo.energy: 2.854 electronvolt
energy: -6.582 -4.103 -6.582 -6.582 -6.582 5.845 5.519 5.519 5.519 -6.582 -6.582 5.519 5.519 5.519 5.845 3.073 3.073 3.073 3.073 -6.582 -6.582 5.519 5.519 5.519 3.073 3.073 5.519 8.878 8.878 11.266 11.266 -5.048 -5.048 -5.048 -5.048 -5.048 -5.048 -5.048 -5.048 3.073 3.073 -5.048 -5.048 -5.965 1.310 5.519 5.519 5.519 5.519 -5.048 3.073 -5.048 3.073 3.073 5.519 5.519 3.073 5.519 43.500 5.519 electronvolt
mo.energy: 2.922 electronvolt
energy: -5.048 -5.048 -5.048 -5.048 -9.955 -9.955 -9.955 -9.955 -9.955 -9.955 -9.955 -9.955 5.519 5.519 5.519 5.519 10.811 10.811 10.811 10.811 electronvolt
mo.energy: 2.950 electronvolt
energy: -5.048 -5.048 -5.048 -5.048 -9.955 -9.955 -9.955 -9.955 -9.955 -9.955 -9.955 -9.955 -6.582 -6.582 5.519 5.519 5.519 5.519 -6.582 -6.582 5.519 5.519 5.845 10.811 10.811 3.073 3.073 electronvolt
mo.energy: 3.261 electronvolt
energy: -6.582 -6.582 5.519 5.519 -5.048 -5.048 3.073 3.073 -6.582 -6.582 -6.582 -6.582 -6.582 5.519 -6.582 -6.582 5.519 5.519 -6.582 5.519 0.324 5.519 5.519 5.519 5.519 11.266 11.266 -4.103 3.073 3.073 3.073 3.073 3.073 3.073 43.500 43.500 -5.048 -5.048 5.519 -6.582 electronvolt
mo.energy: 3.314 electronvolt
energy: -6.582 -6.582 3.073 3.073 -6.582 -6.582 5.519 5.519 5.519 5.519 5.519 5.519 -6.582 5.519 -6.582 5.519 0.324 5.519 -5.048 -5.048 5.519 5.519 5.519 5.519 3.073 5.519 3.073 5.519 -5.048 -5.048 43.500 5.519 -6.582 5.519 43.500 -6.582 -5.048 -5.048 5.519 5.519 43.500 5.519 -5.048 11.266 11.266 43.500 5.519 -5.048 -5.048 -5.048 5.519 electronvolt
mo.energy: 3.363 electronvolt
energy: 5.519 5.519 5.519 5.519 5.845 -5.048 -5.048 -5.048 -5.048 10.811 10.811 10.811 10.811 5.519 5.519 23.286 5.519 23.286 5.519 23.286 10.811 23.286 -15.871 -15.871 10.811 10.811 -15.871 -15.871 10.811 5.519 5.519 10.811 10.811 11.266 10.811 10.811 11.266 11.266 11.266 electronvolt
mo.energy: 3.556 electronvolt
energy: -5.048 -5.048 -5.048 -5.048 -5.048 -5.048 5.519 5.519 5.519 5.519 5.519 -5.048 5.519 -5.048 -5.048 -5.048 8.878 8.878 5.519 5.519 5.519 5.519 5.519 5.519 3.073 3.073 3.073 5.519 3.073 -7.353 5.519 -7.353 electronvolt
mo.energy: 3.568 electronvolt
energy: 5.519 5.519 -5.048 -5.048 11.266 11.266 -6.582 -6.582 5.519 5.519 5.519 5.519 5.519 -6.582 -6.582 5.519 5.519 -15.871 -15.871 -5.048 -5.048 5.519 3.073 3.073 5.519 15.427 15.427 -5.048 -5.048 5.519 5.519 -15.871 -15.871 -5.048 -5.048 -5.048 -5.048 -5.048 3.073 -5.048 5.519 5.519 3.073 8.878 3.073 8.878 3.073 5.519 5.519 -5.048 -5.048 electronvolt
mo.energy: 3.889 electronvolt
energy: -4.103 -5.048 -5.048 5.519 5.519 11.266 11.266 5.519 5.519 -15.871 -15.871 -5.048 -5.048 -5.048 -5.048 5.519 5.519 -5.048 5.845 -5.048 -5.048 -5.048 5.519 5.519 1.310 15.427 15.427 -6.582 -6.582 -6.582 -6.582 5.519 5.519 -5.048 5.845 -5.048 5.519 23.286 5.519 5.519 5.519 -6.582 23.286 5.519 -6.582 3.073 -7.353 -7.353 5.519 3.073 electronvolt
mo.energy: 3.914 electronvolt
energy: -5.048 -5.048 -5.048 -5.048 -5.048 -5.048 -5.048 -5.048 -5.048 -5.048 3.073 5.519 3.073 3.073 5.519 3.073 0.324 5.519 5.519 5.519 5.519 -7.353 -7.353 5.519 -5.048 5.519 -5.048 -6.582 23.286 -6.582 5.519 -6.582 5.519 -6.582 5.519 5.519 5.519 electronvolt
charge: 0
title: Nitrogen (TZ2P)
title: Carbon (TZ2P)
title: Oxygen (TZ2P)
title: Ruthenium (TZ2P, all electron)
title: *** (NO TITLE) ***
charge: -1
