program: Gaussian 09
title: 000005832
version: EM64L-G09RevD.01
frameworkgroup: C1[X(C22H28O3)]
method: RPBEPBE
basis: SDD
operation: Freq
keyword: #pfreq=noraman
keyword: PBEPBE/SDD
title: #p freq=noraman PBEPBE/SDD
converged: YES YES NO NO
title: Mulliken charges:
elementType: O O O C C C C C C C C C C C C C C C C C C C C C C H H H H H H H H H H H H H H H H H H H H H H H H H H H H
charge: -0.286502 -0.234256 -0.228928 0.309512 -0.165922 -0.129815 -0.094656 0.160232 -0.526157 -0.539033 -0.514303 -0.229759 -0.501121 -0.489963 -0.818836 -0.633471 0.538473 -0.496057 0.268211 -0.540338 -0.552882 0.176442 0.278684 -0.537744 -0.761656 0.251863 0.221608 0.242038 0.227056 0.220459 0.221790 0.225229 0.216084 0.209192 0.222220 0.231350 0.261814 0.227562 0.226826 0.231058 0.246486 0.218688 0.216717 0.230854 0.216982 0.219461 0.232528 0.245660 0.256176 0.288270 0.244671 0.251141 0.246061
chargesum: 0.00000
title: Mulliken charges with hydrogens summed into heavy atoms:
elementType: O O O C C C C C C C C C C C C C C C C C C C C C C
charge: -0.286502 -0.234256 -0.228928 0.309512 0.085941 0.091793 0.147382 0.160232 -0.078641 -0.092015 -0.089026 -0.007539 -0.007957 -0.035576 -0.122604 -0.185899 0.538473 -0.059615 0.268211 -0.062149 -0.296706 0.176442 0.278684 -0.249474 -0.019784
polarizability: 2.96452685e+02 6.91778282e+00 2.09275007e+02 -1.75614452e+01 -5.62607899e+00 2.04565014e+02
1716.lowfreq: -16.5307 -2.8596 0.0004 0.0005 0.0006 6.8233 11.8313 29.2223 42.3563
frequency: -13.7460 29.1599 42.2144 59.2684 74.4288 80.3608 91.6716 98.5933 125.3999 134.5893 150.1733 174.2290 183.0193 190.0446 199.9831 228.8466 237.4871 264.7582 280.9660 282.6397 314.2129 332.3904 348.5683 359.1521 380.2907 394.5677 412.5332 422.4518 436.4975 445.0165 466.2980 481.3490 486.1242 500.9445 529.4482 536.0263 563.3961 577.6042 592.2088 621.7328 628.9900 641.6888 668.2680 674.8795 687.5281 709.1348 760.7975 776.8020 805.6929 813.5364 830.7625 845.2766 860.5231 866.8363 884.0276 892.8944 921.8069 933.0140 944.1742 950.5628 963.1508 967.4590 978.7086 988.5653 997.7058 1005.1808 1027.2921 1035.4674 1039.4661 1043.7788 1054.7342 1067.6095 1080.1775 1094.0027 1105.0450 1110.2096 1126.0063 1145.1753 1150.2624 1159.4675 1163.2657 1178.5423 1186.4626 1192.0555 1203.6759 1213.4176 1222.1575 1229.3540 1242.0626 1251.3477 1260.0865 1272.8087 1279.8353 1286.5841 1289.3330 1302.0910 1306.0749 1314.4615 1320.9696 1325.2518 1330.5845 1331.3978 1341.0391 1347.1209 1351.4900 1366.1557 1372.7207 1380.6746 1388.6033 1444.0601 1452.4244 1454.3247 1458.9139 1462.2611 1465.9410 1466.3590 1470.5674 1477.7263 1478.9486 1488.0867 1489.6214 1584.4763 1635.2305 1654.8374 2131.5701 2928.5138 2931.1638 2940.5799 2955.2975 2966.8491 2973.2593 2974.7087 2975.8140 2982.1252 2994.6619 2995.5324 3001.8154 3005.7577 3032.0308 3032.9392 3038.3520 3045.6577 3050.7844 3056.0136 3059.8305 3066.1157 3090.6875 3096.1143 3098.6190 3114.5093 3124.1609 3140.5168 3427.8173
redmass: 1.0815 6.6207 4.1336 5.3114 3.8806 4.5937 4.0781 3.2482 3.3688 3.4533 2.1764 3.6048 4.0960 2.3891 2.0952 2.9020 2.3750 2.9612 2.9096 2.6887 2.9834 3.0594 2.6592 2.5074 3.4769 2.9432 3.1520 3.5556 3.7505 3.8767 4.4843 2.8364 3.5997 3.8498 3.1589 4.0084 3.4182 3.5886 2.4402 2.1374 1.8276 3.3484 1.3280 2.5688 3.6478 3.8813 2.2640 1.7226 2.1108 2.8061 2.3222 2.0172 3.1722 2.5093 2.3225 1.4068 2.2861 1.9611 2.8239 2.3047 2.3637 2.1862 2.9778 1.9008 1.8189 2.0123 2.4470 2.1540 1.6770 2.9100 2.1483 2.3090 2.2455 1.9957 1.9877 1.6621 2.2502 1.4436 1.7553 1.6620 2.1134 1.4676 1.8440 3.3545 1.8346 1.6352 1.4970 1.2770 1.7272 1.5360 1.7402 1.4046 1.3938 1.5150 1.4181 1.4753 1.2914 1.4754 1.4855 1.3468 1.3906 1.3268 1.4382 1.5718 1.8687 1.5974 1.5699 1.2336 1.1970 1.0826 1.0574 1.0513 1.0680 1.0982 1.0946 1.0792 1.0783 1.0760 1.0858 1.0697 1.0691 9.7996 7.4503 9.8884 6.0490 1.0789 1.0790 1.0834 1.0830 1.0644 1.0611 1.0636 1.0658 1.0609 1.0623 1.0647 1.0371 1.0371 1.0676 1.0963 1.0993 1.1023 1.0997 1.0962 1.1004 1.0952 1.0984 1.0963 1.0987 1.1000 1.0916 1.1015 1.1590
irintensity: 1.2892 1.7441 0.5309 1.6654 0.5774 3.3750 0.2574 0.5970 0.3261 4.3353 0.3486 1.7191 4.6583 0.8610 0.8978 0.3065 1.2631 0.7976 2.4130 1.0682 0.4816 1.8815 0.8823 0.9368 0.5402 2.7027 1.4729 1.7479 0.4289 1.6903 7.0258 3.5544 3.0922 1.1213 3.4518 9.0845 1.5318 6.4050 0.2129 35.2625 27.5521 2.7730 52.9038 8.7445 0.1722 3.9038 12.7440 3.7814 0.9283 1.4817 3.2055 2.1095 1.5761 25.6372 3.5889 24.1550 18.2038 2.7568 133.0204 15.6271 25.4132 35.3337 2.5776 76.4657 4.5049 6.1253 10.7732 4.9465 10.9805 5.8516 2.9218 2.3734 4.0874 1.2784 12.3044 6.9282 2.8785 16.7174 14.7201 6.1548 2.7184 4.1536 8.2073 329.5263 22.3827 3.1320 0.1669 26.8403 7.9328 9.9667 52.4755 4.3522 0.7194 0.0280 3.2844 4.0906 1.6662 6.5664 2.3412 3.4314 4.5495 1.8409 1.3454 4.6479 11.5992 3.2371 3.1623 51.3881 27.8791 12.7876 22.4551 19.6546 4.2281 13.9694 5.4320 7.3226 24.6432 6.3694 8.4625 8.4812 6.9763 201.4000 174.4946 173.8213 0.2502 7.4916 1.9273 0.8828 34.5464 29.8702 0.4682 43.9544 31.9716 21.3352 29.0659 49.2741 32.2607 2.8686 23.8416 20.7847 48.1539 44.4599 38.8769 33.4025 26.9520 25.2595 38.2523 7.4659 21.0047 11.8576 9.4699 11.2523 63.3970
temp: 298.150 k
press: 1.00000 atm
elementType: 8 8 8 6 6 6 6 6 6 6 6 6 6 6 6 6 6 6 6 6 6 6 6 6 6 1 1 1 1 1 1 1 1 1 1 1 1 1 1 1 1 1 1 1 1 1 1 1 1 1 1 1 1
symmnumber: 1
zpe: 1174317.2 jmol-1
zpe.correction: 0.447274 hartree
zpe.thermalcorrener: 0.470374 hartree
zpe.thermalcorrenthalpy: 0.471318 hartree
zpe.thermalcorrgfe: 0.396073 hartree
zpe.sumelectzpe: -1078.871468 hartree
zpe.sumelectthermal: -1078.848367 hartree
zpe.sumelectthermalent: -1078.847423 hartree
zpe.sumelectthermalfe: -1078.922669 hartree
dipole: 3.5020 0.3418 -3.7923
dipole: 5.1732
quadrupole: -196.9948 -141.6513 -147.6899
quadrupole: -13.6608 5.1119 -0.1979
quadrupole: -34.8828 20.4607 14.4221 -13.6608 5.1119 -0.1979
hfenergy: -1079.3187413 hartree
pointgroup: C01 [X(C22H28O3)]
dipole: 1.3535833 0.2783324 -1.494244 debye
polarizability: 295.8112045|8.9514016|210.3660197|-18.2229117|-5.3492352|204.1154828 unknown
InChI: InChI=1S/C22H28O3/c1-4-22(25-14(2)23)12-10-20-19-7-5-15-13-16(24)6-8-17(15)18(19)9-11-21(20,22)3/h1,13,17-20H,5-12H2,2-3H3
charge 0 multiplicity 1
53 atoms
O  3.949932 -0.542952 -0.569618
O  -6.269618 -1.036965 1.471561
O  5.614475 0.267902 0.868294
C  1.503487 -0.080508 -0.569415
C  0.626606 0.963255 0.193729
C  -0.780032 1.11654 -0.415691
C  -1.496182 -0.278078 -0.389694
C  2.842834 0.067557 0.255785
C  0.807722 -1.45891 -0.514388
C  1.542867 2.209447 0.317866
C  -0.639853 -1.378963 -1.07189
C  -2.92618 -0.13439 -1.03074
C  2.99178 1.625885 0.431651
C  -1.616015 2.195125 0.315919
C  1.779823 0.319619 -2.044123
C  -3.066197 2.292363 -0.247922
C  -3.686817 0.913933 -0.226904
C  -3.752379 -1.43542 -1.185046
C  2.797302 -0.627262 1.555986
C  -4.396224 -1.893518 0.14176
C  -4.767176 0.601487 0.558958
C  -5.245608 -0.781936 0.765377
C  5.276607 -0.401491 -0.130052
C  2.752023 -1.199944 2.645531
C  6.199762 -1.186995 -1.0387
H  0.482556 0.558542 1.220451
H  -0.684547 1.433043 -1.47838
H  -1.620991 -0.558822 0.680372
H  0.77107 -1.806636 0.536301
H  1.386875 -2.210889 -1.084456
H  1.283612 2.824095 1.196966
H  1.44593 2.856876 -0.574473
H  -0.622194 -1.202182 -2.166729
H  -1.119195 -2.365022 -0.92563
H  -2.754586 0.280281 -2.049368
H  3.647524 2.012385 -0.368393
H  3.475857 1.864604 1.389582
H  -1.122386 3.181528 0.226751
H  -1.665682 1.951538 1.396807
H  2.269434 1.304432 -2.132569
H  2.443367 -0.424748 -2.514429
H  0.844217 0.358953 -2.626537
H  -3.014918 2.673439 -1.288974
H  -3.660986 3.01002 0.345376
H  -3.135084 -2.245503 -1.612343
H  -4.562606 -1.241464 -1.915591
H  -3.613047 -2.170438 0.878037
H  -5.03264 -2.784852 0.002671
H  -5.298468 1.381357 1.119754
H  2.734938 -1.687469 3.602858
H  5.946718 -1.013293 -2.097622
H  6.078662 -2.26749 -0.841917
H  7.243335 -0.900868 -0.842748
