program: Gaussian 09
title: 000005665
version: EM64L-G09RevD.01
frameworkgroup: C1[X(C6H11NO2)]
method: RPBEPBE
basis: SDD
operation: Freq
keyword: #p
keyword: freq=noraman
keyword: PBEPBE/SDD
title: #p freq=noraman PBEPBE/SDD
converged: YES YES NO NO
title: Mulliken charges:
elementType: O O N C C C C C C H H H H H H H H H H H
charge: -0.415235 -0.241061 -0.563480 -0.390099 -0.212406 -0.493085 -0.014126 0.193207 -0.602303 0.218541 0.193971 0.251904 0.252758 0.271102 0.214629 0.273081 0.251510 0.215869 0.220721 0.374500
chargesum: 0.00000
title: Mulliken charges with hydrogens summed into heavy atoms:
elementType: O O N C C C C C C
charge: -0.040735 -0.241061 -0.038888 0.022413 0.039498 0.030775 0.200504 0.193207 -0.165713
polarizability: 7.90564814e+01 -6.05455816e+00 8.31257832e+01 5.03643962e+00 -9.35336351e-01 6.70551511e+01
1716.lowfreq: -21.8351 -7.7616 -0.0007 -0.0003 0.0000 8.5948 29.9570 42.5611 76.4242
frequency: 29.7691 41.7812 76.2237 101.7411 203.9701 205.5653 256.7218 307.8857 323.5102 342.4770 459.2654 495.1051 518.4961 576.7629 603.0709 639.7449 687.2640 760.6999 807.7936 894.8094 947.1091 956.1567 1004.7822 1017.0287 1030.5465 1039.7678 1087.1339 1104.5665 1157.7889 1206.6218 1232.1940 1254.8395 1288.5649 1310.6845 1323.6113 1361.8391 1373.0248 1432.7349 1435.4323 1449.6014 1631.5219 1661.7853 1665.8162 2978.5004 2997.4690 3029.1176 3044.0484 3052.7765 3062.4926 3089.5334 3192.6890 3436.2410 3509.4776 3567.1477
redmass: 8.3175 4.1037 2.6288 4.0649 1.1273 2.0177 3.0706 2.5812 2.0839 2.1123 3.2186 1.9446 2.5792 2.0015 2.4579 1.3415 1.8394 2.2545 2.9980 1.8527 1.4052 1.6019 1.1560 2.1346 2.4530 1.6796 2.1815 3.0824 1.3626 1.2875 1.4867 1.6205 1.2369 1.2329 1.4401 1.6583 1.3578 1.0922 1.2104 1.1104 1.1310 5.1197 5.9356 1.0609 1.0620 1.0876 1.0972 1.0985 1.0838 1.0696 1.1146 1.0443 1.0639 1.0974
irintensity: 0.8000 0.3421 0.3685 0.4902 50.0430 7.8369 5.2092 16.4180 13.5889 3.9930 15.1954 21.7336 12.8169 141.7388 128.6677 134.5822 10.1933 14.5268 15.9581 28.9173 71.0199 17.6715 17.5425 4.4452 191.6406 81.1718 35.1190 7.6905 17.8247 1.4944 0.8507 5.7448 1.2252 8.3328 4.0348 43.0871 6.4122 37.7276 25.5209 1.2016 28.6857 71.5838 127.9100 32.0520 18.1236 5.4093 10.2841 13.9943 42.8020 5.5246 28.3228 1.9527 20.0026 0.6753
temp: 298.150 k
press: 1.00000 atm
elementType: 8 8 7 6 6 6 6 6 6 1 1 1 1 1 1 1 1 1 1 1
symmnumber: 1
zpe: 432242.5 jmol-1
zpe.correction: 0.164632 hartree
zpe.thermalcorrener: 0.175383 hartree
zpe.thermalcorrenthalpy: 0.176327 hartree
zpe.thermalcorrgfe: 0.127139 hartree
zpe.sumelectzpe: -439.691405 hartree
zpe.sumelectthermal: -439.680654 hartree
zpe.sumelectthermalent: -439.679710 hartree
zpe.sumelectthermalfe: -439.728899 hartree
dipole: -0.7242 -0.0647 2.1184
dipole: 2.2397
quadrupole: -53.7617 -52.6370 -55.4300
quadrupole: -3.1476 6.9393 -3.8776
quadrupole: 0.1812 1.3059 -1.4871 -3.1476 6.9393 -3.8776
hfenergy: -439.8560375 hartree
pointgroup: C01 [X(C6H11N1O2)]
dipole: 0.3149506 0.1064399 0.8160502 debye
dipolederiv: -1.005695 0.4249269 -0.1591051 0.4695904 -0.7152766 0.0355505 -0.0702164 -0.0182328 -0.2707183 -0.6090167 0.0731977 0.1263955 0.2208958 -0.5443618 0.1923808 -0.0765537 0.3403063 -0.764964 -0.7324796 0.0351855 -0.3379244 0.0284456 -0.4765582 -0.0441834 -0.3988705 0.0773026 -0.4014855 0.001675 0.0373805 -0.0969107 -0.0599343 -0.0250219 -0.0144605 -0.1158522 0.0700981 0.0794745 0.4927209 -0.0510978 0.2056159 -0.1382382 0.4367897 -0.0378075 0.2148362 -0.0421303 0.2395149 -0.1040899 0.0683738 0.0702555 -0.0182011 0.0231624 0.0395868 0.1834283 0.0501362 -0.2240184 -0.0705949 -0.0107841 -0.1974431 0.0570182 0.1368369 0.052371 -0.2676216 -0.0759798 0.0049417 1.209812 -0.5321805 -0.155754 -0.6893844 0.7804781 -0.3210432 -0.1380503 -0.3875489 0.9418206 -0.2296551 0.0727648 -0.2257038 0.036021 -0.1494922 -0.043115 -0.2462018 -0.008477 -0.0923166 0.0270477 -0.0880352 -0.0083638 -0.0501501 -0.130758 0.0334472 -0.0224664 0.0667149 0.0524985 -0.04025 0.0502455 0.1186039 0.0242086 0.0808172 -0.0191332 0.076369 -0.0496045 -0.1161473 0.0138038 0.0288445 0.0640667 0.0398114 0.0085461 -0.0410177 0.0690965 -0.0212561 -0.0655931 -0.0574244 -0.0221644 -0.0894664 -0.0126466 0.0983205 -0.0579628 -0.0861704 -0.0396398 -0.002724 0.1193812 0.0102423 0.0624117 0.0336839 -0.052833 0.0325282 0.0352725 0.0101295 0.1062546 0.0307998 -0.0124172 0.1297692 0.0271202 0.0353702 -0.0547743 0.1598474 -0.0101106 -0.0298642 0.1905493 -0.0808085 0.122518 0.0074997 -0.0222529 0.1021188 0.1247899 -0.0129883 0.2855372 0.2670394 0.0551318 0.0560874 0.1203211 0.1684362 0.0145619 0.1758908 -0.04176 0.0338891 0.1201892 -0.0864207 0.0876598 -0.0866649 -0.0739278 0.0489652 0.1038713 0.0663749 0.0934395 0.0649615 0.0163197 0.1447495 -0.0044077 0.081383 0.0067185 0.1468462 -0.0225742 -0.0029144 0.3112255 0.0112953 0.082538 -0.0049888 0.340342 0.0752685 0.1317552 0.0492397 0.133375 unknown
polarizability: 78.2486621|-6.4091451|83.6596378|-4.7105864|-0.4906113|67.3291158 unknown
InChI: InChI=1S/C6H11NO2/c1-2-5(7)3-4-6(8)9/h2,5,8H,1,3-4,7H2
charge 0 multiplicity 1
20 atoms
O  2.963206 -0.803636 0.029767
O  1.81813 0.765622 -1.237217
N  -2.393444 1.400427 -0.523152
C  -0.255048 1.03407 0.796678
C  -1.299783 0.447531 -0.214054
C  0.986603 0.148824 1.022186
C  -1.907692 -0.837491 0.321026
C  1.911824 0.104117 -0.178972
C  -1.65844 -2.084523 -0.147253
H  0.062141 2.02489 0.418244
H  -0.759391 1.198583 1.770518
H  -0.775081 0.233408 -1.162544
H  1.585042 0.510817 1.881152
H  0.69599 -0.88944 1.271177
H  -2.593038 -0.710934 1.176479
H  -2.080473 2.23319 -1.033944
H  -2.968296 1.647067 0.291038
H  -2.126182 -2.970981 0.296315
H  -0.993037 -2.254384 -1.003089
H  3.558769 -0.801458 -0.768555
