program: Orca
programVersion: 5.0.2
elementType: C C C C C C C H H C C H H O O O O O H C H H C H C H H H C H H H C H C C H H H C H H H C H C C H H H C H H H H Ag C H H H C H C H H H O H
elementType: Ag
charge: 0
multiplicity: 1
keywords: wB97X-D3 TightOpt Freq def2-TZVPP def2/J RIJCOSX TightSCF defgrid3
frequency: 0.00 0.00 0.00 0.00 0.00 0.00 11.34 19.87 28.10 33.77 41.70 46.29 49.26 51.85 60.56 61.69 74.53 93.57 95.33 99.20 103.08 120.48 122.38 131.45 134.22 145.27 158.10 163.76 168.48 182.95 190.23 201.54 220.17 225.38 226.73 228.43 233.34 244.65 255.96 266.07 270.48 285.48 294.65 301.35 325.05 333.86 348.71 354.55 371.10 378.73 384.82 397.03 412.44 415.03 421.27 442.88 452.72 454.94 467.76 478.33 486.59 501.27 521.94 523.32 541.56 562.74 574.90 622.42 667.75 706.98 756.98 763.35 767.31 792.34 806.41 825.21 827.05 844.56 862.63 883.12 894.03 910.31 923.87 932.36 939.28 940.77 944.13 959.48 969.82 973.35 978.45 983.20 991.80 993.31 1025.35 1032.94 1036.85 1045.77 1065.19 1095.25 1105.59 1108.27 1110.35 1124.81 1139.64 1145.04 1152.87 1163.82 1174.69 1181.25 1182.91 1199.92 1203.88 1205.85 1242.00 1255.78 1272.05 1285.39 1311.11 1319.06 1324.50 1327.93 1330.66 1346.81 1374.09 1379.69 1384.11 1385.25 1389.84 1404.58 1410.52 1414.65 1421.82 1422.39 1424.76 1425.88 1430.92 1432.05 1432.78 1454.17 1461.94 1465.60 1468.06 1477.40 1477.79 1483.94 1487.84 1488.33 1490.02 1490.44 1494.95 1496.79 1497.52 1500.40 1504.65 1507.08 1508.16 1508.77 1509.42 1514.32 1514.46 1593.75 1642.12 1672.08 1686.50 1689.38 1751.52 2411.99 2994.25 3045.96 3046.30 3046.80 3049.48 3049.80 3055.33 3055.48 3056.00 3059.36 3070.30 3084.80 3085.87 3108.66 3110.10 3117.26 3118.48 3122.95 3124.34 3128.71 3132.54 3132.65 3133.74 3138.60 3138.98 3139.17 3145.28 3146.12 3146.21 3150.55 3158.85 3164.86 3170.58 3172.15 3584.00 3714.60
frequency: 11.34 19.87 28.10 33.77 41.70 46.29 49.26 51.85 60.56 61.69 74.53 93.57 95.33 99.20 103.08 120.48 122.38 131.45 134.22 145.27 158.10 163.76 168.48 182.95 190.23 201.54 220.17 225.38 226.73 228.43 233.34 244.65 255.96 266.07 270.48 285.48 294.65 301.35 325.05 333.86 348.71 354.55 371.10 378.73 384.82 397.03 412.44 415.03 421.27 442.88 452.72 454.94 467.76 478.33 486.59 501.27 521.94 523.32 541.56 562.74 574.90 622.42 667.75 706.98 756.98 763.35 767.31 792.34 806.41 825.21 827.05 844.56 862.63 883.12 894.03 910.31 923.87 932.36 939.28 940.77 944.13 959.48 969.82 973.35 978.45 983.20 991.80 993.31 1025.35 1032.94 1036.85 1045.77 1065.19 1095.25 1105.59 1108.27 1110.35 1124.81 1139.64 1145.04 1152.87 1163.82 1174.69 1181.25 1182.91 1199.92 1203.88 1205.85 1242.00 1255.78 1272.05 1285.39 1311.11 1319.06 1324.50 1327.93 1330.66 1346.81 1374.09 1379.69 1384.11 1385.25 1389.84 1404.58 1410.52 1414.65 1421.82 1422.39 1424.76 1425.88 1430.92 1432.05 1432.78 1454.17 1461.94 1465.60 1468.06 1477.40 1477.79 1483.94 1487.84 1488.33 1490.02 1490.44 1494.95 1496.79 1497.52 1500.40 1504.65 1507.08 1508.16 1508.77 1509.42 1514.32 1514.46 1593.75 1642.12 1672.08 1686.50 1689.38 1751.52 2411.99 2994.25 3045.96 3046.30 3046.80 3049.48 3049.80 3055.33 3055.48 3056.00 3059.36 3070.30 3084.80 3085.87 3108.66 3110.10 3117.26 3118.48 3122.95 3124.34 3128.71 3132.54 3132.65 3133.74 3138.60 3138.98 3139.17 3145.28 3146.12 3146.21 3150.55 3158.85 3164.86 3170.58 3172.15 3584.00 3714.60
formula: C24H37O6Ag
InChI: InChI=1S/C21H29O5.C3H8O.Ag/c1-12(2)7-8-15-18(23)17(16(22)11-14(5)6)20(25)21(26,19(15)24)10-9-13(3)4;1-3(2)4;/h7,9,14,22,26H,8,10-11H2,1-6H3;3-4H,1-2H3;
68 atoms
C  2.435048 -0.679835 -0.556754
C  2.092809 -1.425264 0.631965
C  0.73466 -1.999713 0.73991
C  -0.175294 -1.90753 -0.342955
C  0.122446 -1.154518 -1.477806
C  1.257304 -0.136604 -1.373838
C  -1.488704 -2.643828 -0.295708
H  -1.631942 -3.199444 -1.221207
H  -1.448026 -3.364654 0.523205
C  3.001174 -1.658968 1.654808
C  4.40101 -1.13385 1.703644
H  4.924459 -1.692844 2.481867
H  4.887292 -1.311924 0.747142
O  2.648243 -2.339076 2.704945
O  0.428925 -2.62748 1.792933
O  -0.585192 -1.156052 -2.515948
O  3.553981 -0.386933 -0.952559
O  1.701449 0.274217 -2.628819
H  2.667427 0.266696 -2.558548
C  0.741891 1.097466 -0.5731
H  0.51617 0.802027 0.449681
H  1.581614 1.800144 -0.531299
C  4.464068 0.370271 2.024769
H  3.90655 0.897253 1.246287
C  3.832293 0.689111 3.376158
H  4.35401 0.168905 4.183117
H  2.784282 0.388003 3.416541
H  3.881436 1.760009 3.581119
C  5.911919 0.843316 1.963729
H  6.523633 0.322449 2.705004
H  5.982814 1.913029 2.168029
H  6.343319 0.657943 0.979075
C  -2.673865 -1.7454 -0.03046
H  -2.676575 -1.28054 0.954066
C  -3.78852 -1.596207 -0.79338
C  -4.00649 -2.323746 -2.094863
H  -4.614403 -3.215285 -1.918129
H  -4.547243 -1.695216 -2.803242
H  -3.073334 -2.626983 -2.563101
C  -5.006628 -0.88779 -0.248505
H  -4.787898 -0.345825 0.671647
H  -5.78319 -1.625201 -0.027462
H  -5.434594 -0.194207 -0.974745
C  -0.409011 1.815759 -1.211759
H  -0.306454 1.970935 -2.282522
C  -1.421128 2.450512 -0.572323
C  -1.576754 2.482779 0.925978
H  -2.630055 2.458843 1.208498
H  -1.164757 3.418128 1.314629
H  -1.070403 1.660857 1.426602
C  -2.32603 3.398059 -1.321643
H  -2.094694 4.425695 -1.028625
H  -3.378387 3.234419 -1.081574
H  -2.195577 3.318874 -2.400176
H  1.653522 -2.595491 2.535514
Ag -2.317339 0.264758 -1.350525
C  -3.424623 2.021449 -5.029017
H  -4.1451 1.339053 -5.482555
H  -3.268269 2.86247 -5.704945
H  -3.85441 2.401557 -4.100854
C  -2.121587 1.298479 -4.759837
H  -1.404879 2.002986 -4.31492
C  -1.498746 0.710049 -6.012868
H  -0.574289 0.184416 -5.768793
H  -2.186896 0.004055 -6.480667
H  -1.262194 1.495485 -6.732022
O  -2.401209 0.265813 -3.819977
H  -1.602481 -0.27467 -3.678636
totalener: -1535.39312964 hartree
nucrepener: 3818.33314628 hartree
electener: -5353.72627592 hartree
oneelecener: -9754.40185841 hartree
twoeener: 4400.67558249 hartree
kineticenergy: 1438.47695837 hartree
xcener: -144.147618006709 hartree
chargesum: -0.0000000
charge: 0.136826 -0.246631 0.204952 -0.114856 0.202527 0.563541 -0.210693 0.118254 0.108258 0.266936 -0.143697 0.096416 0.114788 -0.316059 -0.479390 -0.543404 -0.421486 -0.376638 0.201436 -0.310723 0.116027 0.103913 0.014677 0.044689 -0.250841 0.080493 0.085262 0.079662 -0.274691 0.077967 0.079181 0.095402 -0.157796 0.150108 0.112994 -0.256732 0.115631 0.090713 0.105648 -0.231936 0.084334 0.110726 0.087093 -0.162442 0.175800 0.084162 -0.256954 0.088787 0.120218 0.103556 -0.242873 0.113706 0.090674 0.085401 0.245366 0.178414 -0.228554 0.087726 0.089016 0.070685 0.114769 0.035387 -0.241767 0.098400 0.084827 0.077739 -0.367117 0.242191
charge: -0.255282 -0.133549 -0.248262 -0.139758 -0.280868 -0.239529 -0.006516 0.031807 0.037373 -0.147731 -0.000288 0.033529 0.030834 0.367022 0.135892 0.073458 0.117118 0.306423 -0.145431 0.004327 0.033528 0.041514 -0.101691 0.023960 0.008499 0.016251 0.012178 0.010471 0.009990 0.013562 0.011360 0.015959 0.004766 0.035164 -0.111238 0.025420 0.023827 0.025526 0.025385 0.018650 0.022865 0.025752 0.021460 0.005348 0.038132 -0.102795 0.025621 0.024062 0.027571 0.022573 0.023500 0.026740 0.023729 0.025510 -0.198796 0.246404 0.004771 0.017472 0.016683 0.010231 -0.209332 0.006918 0.008323 0.018727 0.015881 0.015240 0.317229 -0.163475
qa: 0.1368 -0.2466 0.2050 -0.1149 0.2025 0.5635 -0.2107 0.1183 0.1083 0.2669 -0.1437 0.0964 0.1148 -0.3161 -0.4794 -0.5434 -0.4215 -0.3766 0.2014 -0.3107 0.1160 0.1039 0.0147 0.0447 -0.2508 0.0805 0.0853 0.0797 -0.2747 0.0780 0.0792 0.0954 -0.1578 0.1501 0.1130 -0.2567 0.1156 0.0907 0.1056 -0.2319 0.0843 0.1107 0.0871 -0.1624 0.1758 0.0842 -0.2570 0.0888 0.1202 0.1036 -0.2429 0.1137 0.0907 0.0854 0.2454 0.1784 -0.2286 0.0877 0.0890 0.0707 0.1148 0.0354 -0.2418 0.0984 0.0848 0.0777 -0.3671 0.2422
va: 4.0757 3.3920 4.0311 3.3517 3.7826 3.6679 4.0120 0.9966 1.0290 3.8980 3.8363 1.0275 1.0293 2.2242 2.0521 1.9078 2.0631 2.0988 1.0737 4.0022 0.9908 1.0241 3.8744 1.0217 3.9263 1.0089 1.0125 1.0047 3.9397 1.0052 1.0071 1.0059 3.8306 1.0239 3.6030 3.9504 0.9950 1.0065 1.0154 3.9324 1.0083 0.9964 1.0020 3.6819 1.0332 3.6603 3.9578 1.0036 0.9963 1.0055 3.9621 0.9999 1.0047 1.0065 1.1128 1.6607 3.8938 1.0137 1.0104 1.0094 3.9475 0.9849 3.9423 1.0129 1.0106 1.0121 2.0231 1.0302
dispcorr: -0.043806613 hartree
energy: -1535.436934428368
dipole: 127.43893 -129.83635 -2.39742 -6.68187 8.96483 2.28296 34.65386 -34.90431 -0.25045
magnitude: 3.31998 au
magnitude: 8.43871 debye
temp: 298.15 k
press: 1.00 atm
zeropoint: 0.57877047 hartree
thermalvibcorrection: 0.03400126 hartree
thermalrotcorrection: 0.00141627 hartree
thermaltrasncorrection: 0.00141627 hartree
thermaltotal: -1534.82133016 hartree
thermalcorr: 0.03683380 hartree
nonthermalcorr: 0.57877047 hartree
totalcorr: 0.61560427 hartree
thermalcorrenthalpy: 0.00094421 hartree
totalenthalpy: -1534.82038595 hartree
totalentropycorr: -0.10068012 hartree
gibbsenthalpy: -1534.92106607 hartree
gibbsminuselec: 0.51586836 hartree
