program: Orca
programVersion: 5.0.2
elementType: C C C C C C C H H C C H H O O O O O H C H H C H C H H H C H H H C H C C H H H C H H H C H C C H H H C H H H H Ag C O H C H H H C H H H H
elementType: Ag
charge: 0
multiplicity: 1
keywords: wB97X-D3 TightOpt Freq def2-TZVPP def2/J RIJCOSX TightSCF defgrid3
frequency: 0.00 0.00 0.00 0.00 0.00 0.00 17.49 20.20 22.24 27.72 31.46 35.96 40.60 46.17 53.21 59.55 65.44 79.01 91.79 101.91 107.20 115.78 123.42 128.97 133.80 142.09 149.64 162.82 173.23 191.14 198.44 201.60 223.60 226.32 227.30 233.75 244.91 255.25 264.24 279.66 294.83 302.18 304.10 322.52 328.48 336.92 349.82 367.03 373.04 376.39 384.11 396.09 408.70 415.82 429.78 443.08 446.23 453.56 462.16 470.67 482.60 519.56 521.51 531.20 560.59 579.49 633.93 646.29 671.90 707.36 752.84 774.63 782.95 796.53 816.39 828.45 840.17 862.25 875.93 878.48 892.57 909.76 922.75 931.64 935.95 939.53 941.96 956.84 968.35 971.55 978.82 983.85 984.93 988.59 1016.83 1028.99 1038.20 1048.66 1067.97 1094.75 1105.96 1111.34 1112.70 1124.44 1142.60 1146.24 1154.36 1162.03 1163.68 1167.05 1198.60 1201.28 1205.14 1206.43 1241.00 1251.63 1270.36 1285.87 1292.51 1315.44 1324.99 1328.96 1342.44 1347.97 1374.32 1378.73 1379.71 1385.00 1387.91 1407.53 1412.02 1415.22 1421.41 1423.04 1426.56 1429.28 1431.05 1431.77 1432.65 1455.51 1459.18 1468.85 1474.85 1476.03 1479.73 1487.79 1488.95 1490.06 1490.79 1492.14 1495.38 1497.01 1498.49 1498.87 1503.83 1506.42 1508.49 1508.74 1511.23 1512.62 1517.98 1592.23 1633.89 1661.57 1687.52 1730.57 1779.12 2298.70 3041.81 3044.79 3046.03 3046.33 3048.50 3049.56 3049.89 3055.10 3056.23 3057.61 3073.04 3078.30 3086.55 3098.33 3101.51 3113.44 3117.88 3119.64 3122.24 3123.66 3125.28 3130.08 3130.91 3131.18 3132.34 3144.38 3145.44 3149.09 3152.58 3156.05 3156.45 3161.19 3164.01 3178.81 3456.92 3684.89
frequency: 17.49 20.20 22.24 27.72 31.46 35.96 40.60 46.17 53.21 59.55 65.44 79.01 91.79 101.91 107.20 115.78 123.42 128.97 133.80 142.09 149.64 162.82 173.23 191.14 198.44 201.60 223.60 226.32 227.30 233.75 244.91 255.25 264.24 279.66 294.83 302.18 304.10 322.52 328.48 336.92 349.82 367.03 373.04 376.39 384.11 396.09 408.70 415.82 429.78 443.08 446.23 453.56 462.16 470.67 482.60 519.56 521.51 531.20 560.59 579.49 633.93 646.29 671.90 707.36 752.84 774.63 782.95 796.53 816.39 828.45 840.17 862.25 875.93 878.48 892.57 909.76 922.75 931.64 935.95 939.53 941.96 956.84 968.35 971.55 978.82 983.85 984.93 988.59 1016.83 1028.99 1038.20 1048.66 1067.97 1094.75 1105.96 1111.34 1112.70 1124.44 1142.60 1146.24 1154.36 1162.03 1163.68 1167.05 1198.60 1201.28 1205.14 1206.43 1241.00 1251.63 1270.36 1285.87 1292.51 1315.44 1324.99 1328.96 1342.44 1347.97 1374.32 1378.73 1379.71 1385.00 1387.91 1407.53 1412.02 1415.22 1421.41 1423.04 1426.56 1429.28 1431.05 1431.77 1432.65 1455.51 1459.18 1468.85 1474.85 1476.03 1479.73 1487.79 1488.95 1490.06 1490.79 1492.14 1495.38 1497.01 1498.49 1498.87 1503.83 1506.42 1508.49 1508.74 1511.23 1512.62 1517.98 1592.23 1633.89 1661.57 1687.52 1730.57 1779.12 2298.70 3041.81 3044.79 3046.03 3046.33 3048.50 3049.56 3049.89 3055.10 3056.23 3057.61 3073.04 3078.30 3086.55 3098.33 3101.51 3113.44 3117.88 3119.64 3122.24 3123.66 3125.28 3130.08 3130.91 3131.18 3132.34 3144.38 3145.44 3149.09 3152.58 3156.05 3156.45 3161.19 3164.01 3178.81 3456.92 3684.89
formula: C24H37O6Ag
InChI: InChI=1S/C21H29O5.C3H8O.Ag/c1-12(2)7-8-15-18(23)17(16(22)11-14(5)6)20(25)21(26,19(15)24)10-9-13(3)4;1-3(2)4;/h7,9,14,22,26H,8,10-11H2,1-6H3;3-4H,1-2H3;
68 atoms
C  -1.48225 -0.713761 -0.292816
C  -2.51159 0.289678 -0.266437
C  -2.433529 1.351528 0.754177
C  -1.415919 1.345667 1.736901
C  -0.487103 0.30721 1.837118
C  -0.682761 -0.94346 0.991563
C  -1.268901 2.524255 2.66333
H  -2.227286 3.045744 2.715115
H  -1.022755 2.173342 3.664784
C  -3.520427 0.354064 -1.223321
C  -3.773273 -0.674768 -2.279434
H  -4.499775 -0.247475 -2.973309
H  -2.846968 -0.878359 -2.812714
O  -4.374712 1.328769 -1.205885
O  -3.267137 2.30268 0.69379
O  0.503473 0.328022 2.606623
O  -1.185067 -1.434443 -1.241489
O  0.58427 -1.460649 0.618729
H  0.407572 -1.884517 -0.236207
C  -1.486009 -2.000406 1.799446
H  -2.485275 -1.60208 1.977963
H  -1.600883 -2.865367 1.139393
C  -4.323236 -1.994129 -1.707982
H  -3.583476 -2.383922 -1.0045
C  -5.636663 -1.782295 -0.961871
H  -5.522653 -1.08681 -0.128868
H  -6.007028 -2.726123 -0.558564
H  -6.403081 -1.377577 -1.627447
C  -4.480886 -3.010931 -2.83261
H  -4.850499 -3.963074 -2.448461
H  -3.528501 -3.195379 -3.331873
H  -5.193229 -2.656547 -3.5823
C  -0.250289 3.532315 2.186485
H  -0.466584 3.957507 1.207987
C  0.774353 4.087647 2.893013
C  1.495953 5.307628 2.372491
H  1.172747 6.183941 2.941264
H  2.576439 5.230481 2.5020
H  1.280695 5.491812 1.320571
C  1.054496 3.749328 4.336125
H  2.119096 3.835995 4.556735
H  0.729244 2.746072 4.602959
H  0.534883 4.460324 4.984261
C  -0.820971 -2.425152 3.070718
H  0.022464 -3.09599 2.946917
C  -1.133045 -2.037711 4.303963
C  -0.351575 -2.536827 5.485161
H  0.132725 -1.703329 6.001219
H  0.41915 -3.246612 5.188078
H  -1.007508 -3.02335 6.212277
C  -2.217068 -1.057345 4.645661
H  -2.912499 -1.485589 5.372043
H  -2.786158 -0.718784 3.782897
H  -1.775573 -0.172469 5.112299
H  -4.071309 1.934392 -0.402792
Ag 1.620628 2.221021 1.657983
C  2.708197 0.750012 -1.009707
O  2.467549 0.593733 0.395464
H  1.873073 -0.170679 0.555077
C  1.439967 1.154141 -1.739298
H  1.054986 2.096055 -1.337779
H  1.637526 1.29464 -2.802705
H  0.664148 0.395673 -1.640425
C  3.818848 1.76727 -1.157942
H  4.085764 1.894292 -2.206862
H  3.495298 2.73948 -0.77395
H  4.705287 1.455167 -0.607017
H  3.053382 -0.218547 -1.385071
totalener: -1535.39347660 hartree
nucrepener: 3806.96822242 hartree
electener: -5342.36169902 hartree
oneelecener: -9732.35718807 hartree
twoeener: 4389.99548905 hartree
kineticenergy: 1438.47498741 hartree
xcener: -144.135993392075 hartree
chargesum: -0.0000000
charge: 0.063279 -0.217199 0.293806 -0.184658 0.116038 0.652000 -0.174939 0.107698 0.108944 0.260074 -0.137608 0.096151 0.110507 -0.315152 -0.481344 -0.510522 -0.439639 -0.406649 0.205680 -0.248893 0.117463 0.100674 0.019723 0.046246 -0.251957 0.089964 0.082608 0.079956 -0.275404 0.082365 0.092561 0.077818 -0.182016 0.159085 0.114771 -0.220769 0.109048 0.088609 0.088098 -0.237192 0.088972 0.106436 0.114362 -0.163420 0.072852 0.005284 -0.216228 0.083795 0.076656 0.081182 -0.245960 0.096701 0.081606 0.080971 0.247604 0.280984 0.164118 -0.389220 0.263222 -0.253644 0.066970 0.093491 0.103835 -0.256766 0.089921 0.060265 0.103351 0.083436
charge: -0.268945 -0.133311 -0.243187 -0.142841 -0.296154 -0.222241 -0.007647 0.039059 0.030547 -0.145732 -0.000866 0.033244 0.029482 0.365001 0.143222 0.067171 0.104378 0.342244 -0.148169 -0.010433 0.031859 0.032374 -0.100624 0.025610 0.010457 0.013924 0.012141 0.015649 0.009928 0.012499 0.014928 0.013347 -0.000217 0.039979 -0.115654 0.019992 0.025899 0.020889 0.024544 0.026628 0.023872 0.026475 0.026460 -0.023520 0.015629 -0.099499 0.012472 0.017706 0.017038 0.015019 0.013178 0.017092 0.012829 0.020441 -0.201658 0.277366 -0.185781 0.331154 -0.143280 0.012915 0.019187 0.019567 0.018242 0.011678 0.019477 0.016645 0.019048 0.021278
qa: 0.0633 -0.2172 0.2938 -0.1847 0.1160 0.6520 -0.1749 0.1077 0.1089 0.2601 -0.1376 0.0962 0.1105 -0.3152 -0.4813 -0.5105 -0.4396 -0.4066 0.2057 -0.2489 0.1175 0.1007 0.0197 0.0462 -0.2520 0.0900 0.0826 0.0800 -0.2754 0.0824 0.0926 0.0778 -0.1820 0.1591 0.1148 -0.2208 0.1090 0.0886 0.0881 -0.2372 0.0890 0.1064 0.1144 -0.1634 0.0729 0.0053 -0.2162 0.0838 0.0767 0.0812 -0.2460 0.0967 0.0816 0.0810 0.2476 0.2810 0.1641 -0.3892 0.2632 -0.2536 0.0670 0.0935 0.1038 -0.2568 0.0899 0.0603 0.1034 0.0834
va: 4.1296 3.3717 4.0177 3.3855 3.8552 3.3070 3.9998 1.0286 0.9941 3.9056 3.8263 1.0280 1.0308 2.2248 2.0549 1.9017 2.0233 2.0758 1.0663 3.9850 0.9976 1.0234 3.8789 1.0212 3.9309 1.0099 1.0051 1.0082 3.9371 1.0072 1.0056 1.0051 3.8471 1.0218 3.6442 3.9501 0.9955 1.0021 1.0074 3.9302 1.0069 1.0136 0.9948 3.8899 1.0317 3.7482 3.9464 0.9988 1.0121 0.9982 3.9453 1.0016 1.0136 0.9989 1.1130 1.4106 3.8192 2.0598 1.0509 3.8933 1.0141 1.0177 1.0356 3.9393 1.0115 1.0119 1.0095 0.9948
dispcorr: -0.043577339 hartree
energy: -1535.437053168635
dipole: -153.39288 155.22775 1.83487 -115.35941 116.66750 1.30809 -42.09637 42.15598 0.05961
magnitude: 2.25419 au
magnitude: 5.72971 debye
temp: 298.15 k
press: 1.00 atm
zeropoint: 0.57884302 hartree
thermalvibcorrection: 0.03387267 hartree
thermalrotcorrection: 0.00141627 hartree
thermaltrasncorrection: 0.00141627 hartree
thermaltotal: -1534.82150494 hartree
thermalcorr: 0.03670521 hartree
nonthermalcorr: 0.57884302 hartree
totalcorr: 0.61554823 hartree
thermalcorrenthalpy: 0.00094421 hartree
totalenthalpy: -1534.82056073 hartree
totalentropycorr: -0.10065381 hartree
gibbsenthalpy: -1534.92121454 hartree
gibbsminuselec: 0.51583863 hartree
