program: Orca
programVersion: 5.0.2
elementType: C C C C C C C H H C C H H O O O O O H C H H C H C H H H C H H H C H C C H H H C H H H C H C C H H H C H H H H Ag C H H H C H C H H H O H H
elementType: Ag
charge: 1
multiplicity: 1
keywords: DLPNO-CCSD(T) def2-TZVPP def2-TZVPP/C VeryTightSCF
formula: C24H38O6Ag
InChI: InChI=1S/C21H29O5.C3H9O.Ag/c1-12(2)7-8-15-18(23)17(16(22)11-14(5)6)20(25)21(26,19(15)24)10-9-13(3)4;1-3(2)4;/h7,9,14,22,26H,8,10-11H2,1-6H3;3H,4H2,1-2H3;
69 atoms
C  1.729172 -0.301155 -1.96849
C  1.460651 -1.360761 -1.020211
C  0.091485 -1.864879 -0.908978
C  -0.933949 -1.387327 -1.825646
C  -0.750993 -0.178641 -2.544785
C  0.546845 0.600205 -2.367311
C  -2.358225 -1.876625 -1.623354
H  -2.883754 -1.938737 -2.574778
H  -2.316324 -2.885986 -1.21051
C  2.46287 -1.936706 -0.236754
C  3.888543 -1.502222 -0.204568
H  4.448571 -2.277498 0.320036
H  4.265704 -1.415101 -1.221079
O  2.176939 -2.889862 0.59387
O  -0.189976 -2.753938 -0.083531
O  -1.618703 0.271093 -3.317314
O  2.806369 -0.018901 -2.46317
O  0.856743 1.270031 -3.549567
H  1.824089 1.254891 -3.599611
C  0.354005 1.612926 -1.20175
H  0.268106 1.07969 -0.254014
H  1.280201 2.194817 -1.153656
C  4.07864 -0.153175 0.520417
H  3.509863 0.602487 -0.028602
C  3.564394 -0.20229 1.955679
H  4.090289 -0.964566 2.534244
H  2.497722 -0.431356 2.004255
H  3.720382 0.756973 2.450397
C  5.550276 0.240466 0.468522
H  6.169006 -0.495097 0.987373
H  5.709918 1.205618 0.950292
H  5.904397 0.314774 -0.56034
C  -3.154046 -1.04124 -0.648234
H  -2.760724 -1.038808 0.366747
C  -4.389711 -0.500691 -0.841922
C  -5.149808 -0.613878 -2.13783
H  -5.808199 -1.485009 -2.093541
H  -5.788632 0.255901 -2.291363
H  -4.50145 -0.71985 -3.004743
C  -5.195724 0.008928 0.327896
H  -4.600776 0.093565 1.236335
H  -6.008519 -0.69458 0.524723
H  -5.66487 0.970681 0.116156
C  -0.791239 2.565747 -1.423443
H  -0.930747 2.876281 -2.455758
C  -1.483799 3.230625 -0.458311
C  -1.217444 3.076072 1.014969
H  -2.140228 3.138566 1.591652
H  -0.584226 3.903772 1.344729
H  -0.708017 2.149879 1.271429
C  -2.386392 4.381697 -0.823787
H  -1.905872 5.315337 -0.521345
H  -3.338118 4.337115 -0.292643
H  -2.576615 4.434674 -1.894738
H  1.182382 -3.058742 0.522295
Ag -2.728371 1.239076 -1.170726
C  0.405324 -2.207707 -6.482983
H  0.006272 -3.18077 -6.768309
H  1.365942 -2.070245 -6.97798
H  -0.262177 -1.423672 -6.843194
C  0.608526 -2.122506 -4.992238
H  0.951006 -1.125833 -4.703562
C  1.481752 -3.199475 -4.403002
H  1.547421 -3.114596 -3.317745
H  1.109676 -4.190025 -4.662872
H  2.489369 -3.089962 -4.80165
O  -0.741468 -2.282185 -4.355923
H  -0.681204 -2.05312 -3.284951
H  -1.329774 -1.580874 -4.680848
totalener: -1526.54315362 hartree
nucrepener: 3882.88576743 hartree
electener: -5409.42892105 hartree
oneelecener: -9851.92236923 hartree
twoeener: 4442.49344818 hartree
kineticenergy: 1436.09707361 hartree
chargesum: 1.0000000
charge: 0.232009 -0.389499 0.344448 -0.106118 -0.044395 0.802417 -0.098527 0.088613 0.132891 0.394412 -0.138617 0.120949 0.112695 -0.380145 -0.565597 -0.591494 -0.520383 -0.477355 0.252659 -0.298462 0.106425 0.109119 0.106271 0.002045 -0.214838 0.074486 0.049429 0.073423 -0.230914 0.068761 0.070852 0.076252 -0.235834 0.154806 0.114219 -0.203463 0.113673 0.081104 0.078170 -0.191800 0.077114 0.109264 0.070298 -0.180135 0.176315 0.078952 -0.197642 0.084442 0.116120 0.073441 -0.182165 0.107496 0.072997 0.082556 0.302510 0.370893 -0.191809 0.094245 0.089618 0.081684 0.170265 0.072782 -0.187743 0.064467 0.097148 0.101149 -0.200212 0.309686 0.263576
charge: -0.225388 -0.158408 -0.218345 -0.133172 -0.265934 -0.218270 0.000093 0.021580 0.041437 -0.065757 0.021165 0.036964 0.031666 0.375415 0.084716 0.009521 0.073802 0.284971 -0.126028 0.017152 0.030333 0.042258 -0.086315 0.015811 0.025133 0.016434 0.002990 0.011068 0.031202 0.013179 0.011581 0.012039 0.008298 0.036035 -0.084573 0.043196 0.028696 0.022776 0.018313 0.040624 0.021852 0.029849 0.018020 0.003339 0.044482 -0.078949 0.044479 0.023082 0.031226 0.016598 0.044374 0.029625 0.019464 0.024645 -0.159703 0.385141 0.039359 0.022265 0.029656 0.016593 -0.061035 0.024840 0.041408 0.015334 0.022351 0.030133 0.587150 -0.052765 -0.039075
qa: 0.2320 -0.3895 0.3444 -0.1061 -0.0444 0.8024 -0.0985 0.0886 0.1329 0.3944 -0.1386 0.1209 0.1127 -0.3801 -0.5656 -0.5915 -0.5204 -0.4774 0.2527 -0.2985 0.1064 0.1091 0.1063 0.0020 -0.2148 0.0745 0.0494 0.0734 -0.2309 0.0688 0.0709 0.0763 -0.2358 0.1548 0.1142 -0.2035 0.1137 0.0811 0.0782 -0.1918 0.0771 0.1093 0.0703 -0.1801 0.1763 0.0790 -0.1976 0.0844 0.1161 0.0734 -0.1822 0.1075 0.0730 0.0826 0.3025 0.3709 -0.1918 0.0942 0.0896 0.0817 0.1703 0.0728 -0.1877 0.0645 0.0971 0.1011 -0.2002 0.3097 0.2636
va: 3.9360 3.1202 3.8929 3.2264 4.1298 3.3167 3.9547 0.9976 1.0155 3.7812 3.8367 1.0169 1.0235 2.1569 1.9084 1.8114 1.9132 1.9750 1.0150 4.0299 1.0021 1.0180 3.8070 1.0284 3.9598 1.0132 1.0089 1.0043 3.9707 1.0073 1.0070 1.0043 3.8153 1.0223 3.5833 3.9446 0.9999 1.0089 1.0059 3.9595 1.0046 0.9987 1.0048 3.6432 1.0259 3.6812 3.9507 1.0063 0.9999 1.0007 3.9535 1.0003 1.0048 1.0070 1.0383 1.2846 3.9658 1.0079 1.0117 1.0083 3.7381 1.0333 3.9472 1.0083 1.0119 1.0116 2.3133 1.0440 0.9952
e0: -1526.543153489 hartree
corrType: DLPNO BASED
energy: -1533.062634831775
dipole: 162.63676 -164.24086 -1.60410 -87.56881 88.19112 0.62231 -16.69160 15.77250 -0.91910
magnitude: 1.95068 au
magnitude: 4.95824 debye
