program: Orca
programVersion: 5.0.2
elementType: C C C C C C C H H C C H H O O O O O H C H H C H C H H H C H H H C H C C H H H C H H H C H C C H H H C H H H H Ag C H H H C H C H H H O H C O C H H H C H H H H H H
elementType: Ag
charge: 1
multiplicity: 1
keywords: DLPNO-CCSD(T) def2-TZVPP def2-TZVPP/C VeryTightSCF
formula: C27H46O7Ag
InChI: InChI=1S/C21H29O5.C3H9O.C3H8O.Ag/c1-12(2)7-8-15-18(23)17(16(22)11-14(5)6)20(25)21(26,19(15)24)10-9-13(3)4;2*1-3(2)4;/h7,9,14,22,26H,8,10-11H2,1-6H3;3H,4H2,1-2H3;3-4H,1-2H3;
81 atoms
C  -2.651256 -1.0789 -1.181753
C  -3.707259 -0.143922 -1.494014
C  -3.657233 1.185953 -0.897147
C  -2.646876 1.512259 0.095638
C  -1.783095 0.540756 0.602438
C  -1.913392 -0.908208 0.153115
C  -2.334176 2.977633 0.331225
H  -3.218102 3.562567 0.067323
H  -2.105113 3.180389 1.376477
C  -4.698964 -0.426939 -2.43874
C  -4.910727 -1.749762 -3.092501
H  -5.637986 -1.60049 -3.891643
H  -3.971844 -2.089193 -3.525329
O  -5.569081 0.475864 -2.76231
O  -4.463767 2.070546 -1.253273
O  -0.936862 0.791614 1.509864
O  -2.291262 -2.024474 -1.863187
O  -0.615857 -1.451068 -0.010797
H  -0.719156 -2.074253 -0.750185
C  -2.699541 -1.741416 1.195241
H  -3.727447 -1.375436 1.243237
H  -2.752003 -2.754385 0.782576
C  -5.432917 -2.820315 -2.112995
H  -4.684577 -2.945478 -1.325724
C  -6.750688 -2.401054 -1.469102
H  -6.653493 -1.473696 -0.900536
H  -7.105921 -3.172689 -0.78523
H  -7.523195 -2.244441 -2.225015
C  -5.568748 -4.150072 -2.845382
H  -5.910924 -4.932354 -2.166989
H  -4.616026 -4.466297 -3.271674
H  -6.294908 -4.075295 -3.658025
C  -1.198412 3.474455 -0.535039
H  -1.328316 3.278827 -1.59766
C  -0.189009 4.320453 -0.179269
C  0.652035 4.996603 -1.233383
H  0.354917 6.046383 -1.299048
H  1.712074 4.986648 -0.977994
H  0.52068 4.548358 -2.21688
C  -0.021225 4.872728 1.212654
H  1.032032 5.027056 1.446637
H  -0.45315 4.236756 1.982763
H  -0.504857 5.851194 1.269928
C  -2.046911 -1.784459 2.544351
H  -0.963663 -1.822385 2.524473
C  -2.657703 -1.851369 3.727531
C  -1.860112 -1.976726 4.995034
H  -2.116247 -1.18275 5.702256
H  -0.788326 -1.939949 4.806005
H  -2.085409 -2.919617 5.498819
C  -4.147149 -1.877028 3.918215
H  -4.466709 -2.875093 4.227349
H  -4.706329 -1.615905 3.022344
H  -4.446572 -1.197433 4.719154
H  -5.327236 1.315625 -2.24904
Ag 0.605194 2.072902 -0.111898
C  2.274651 -0.50197 2.050048
H  3.123574 -0.785488 2.672273
H  1.559112 -1.324717 2.05363
H  1.789088 0.369119 2.494131
C  2.738685 -0.195676 0.639793
H  3.204036 -1.083156 0.201929
C  3.707007 0.962514 0.565026
H  3.98677 1.171256 -0.467207
H  3.260572 1.863491 1.001177
H  4.613398 0.741345 1.127268
O  1.615704 0.1357 -0.203177
H  0.893732 -0.51233 -0.078933
C  -3.459253 2.370108 3.70189
O  -3.231988 1.166369 2.847131
C  -4.799841 2.923897 3.293809
H  -4.998515 3.829889 3.864499
H  -4.82228 3.184979 2.234626
H  -5.59358 2.206311 3.500391
C  -3.3610 1.906715 5.131937
H  -2.394813 1.445002 5.337343
H  -3.465279 2.768024 5.790734
H  -4.153684 1.196599 5.364183
H  -2.651965 3.061569 3.456745
H  -3.335096 1.335239 1.85093
H  -2.307885 0.813179 2.887405
totalener: -1719.76207884 hartree
nucrepener: 4702.25892642 hartree
electener: -6422.02100526 hartree
twoeener: 5326.91698789 hartree
kineticenergy: 1629.24427317 hartree
chargesum: 1.0000000
charge: 0.294278 -0.366401 0.380038 -0.143075 0.031169 0.809210 -0.054277 0.145360 0.027699 0.416705 -0.153343 0.118564 0.119633 -0.383930 -0.580324 -0.722596 -0.530857 -0.534463 0.266903 -0.197628 0.084665 0.107693 0.114311 -0.001337 -0.215293 0.049586 0.072579 0.073139 -0.233306 0.069793 0.076729 0.067668 -0.307140 0.147330 0.132000 -0.178306 0.104497 0.073257 0.081273 -0.199335 0.090859 0.059140 0.113282 -0.174069 0.079785 -0.056873 -0.168483 0.048076 0.073797 0.089284 -0.207299 0.104353 0.062723 0.051852 0.302920 0.529116 -0.196850 0.088830 0.061277 0.045180 0.281909 0.061237 -0.207026 0.093191 0.011966 0.087459 -0.526695 0.286472 0.158756 -0.158155 -0.206574 0.098285 0.092067 0.096960 -0.198672 0.083698 0.110156 0.088900 0.078514 0.302928 0.305256
charge: -0.212374 -0.150659 -0.212981 -0.150889 -0.265747 -0.191949 -0.012439 0.037030 0.012723 -0.057771 0.021446 0.036101 0.033684 0.373444 0.075218 -0.030281 0.071455 0.313314 -0.120744 0.000438 0.023300 0.037884 -0.086358 0.016857 0.024786 0.003265 0.010803 0.015490 0.030560 0.011087 0.012136 0.012592 0.003612 0.038704 -0.085510 0.043514 0.027967 0.019621 0.024240 0.042123 0.023986 0.012383 0.028305 -0.026917 0.016792 -0.102743 0.026995 0.007281 0.015956 0.020595 0.024504 0.023825 0.007078 0.009681 -0.163588 0.362607 0.026131 0.017114 0.011379 0.013510 -0.142983 0.019148 0.029993 0.018049 0.009824 0.021319 0.280686 -0.152514 -0.060629 0.655722 0.043412 0.030020 0.019496 0.023944 0.041029 0.017240 0.029943 0.021168 0.019290 -0.044750 -0.029973
qa: 0.2943 -0.3664 0.3800 -0.1431 0.0312 0.8092 -0.0543 0.1454 0.0277 0.4167 -0.1533 0.1186 0.1196 -0.3839 -0.5803 -0.7226 -0.5309 -0.5345 0.2669 -0.1976 0.0847 0.1077 0.1143 -0.0013 -0.2153 0.0496 0.0726 0.0731 -0.2333 0.0698 0.0767 0.0677 -0.3071 0.1473 0.1320 -0.1783 0.1045 0.0733 0.0813 -0.1993 0.0909 0.0591 0.1133 -0.1741 0.0798 -0.0569 -0.1685 0.0481 0.0738 0.0893 -0.2073 0.1044 0.0627 0.0519 0.3029 0.5291 -0.1968 0.0888 0.0613 0.0452 0.2819 0.0612 -0.2070 0.0932 0.0120 0.0875 -0.5267 0.2865 0.1588 -0.1582 -0.2066 0.0983 0.0921 0.0970 -0.1987 0.0837 0.1102 0.0889 0.0785 0.3029 0.3053
va: 4.0150 3.2474 3.8449 3.3680 4.0463 3.1880 3.8407 1.0091 1.0291 3.7768 3.8467 1.0169 1.0218 2.1536 1.8882 1.5983 1.9152 1.9021 1.0092 3.8963 1.0018 1.0169 3.8083 1.0297 3.9596 1.0075 1.0047 1.0128 3.9689 1.0068 1.0045 1.0071 3.9091 1.0210 3.5990 3.9609 0.9992 1.0050 1.0056 3.9485 1.0075 0.9954 1.0001 3.7241 1.0140 3.7014 3.9418 0.9980 1.0063 1.0021 3.9578 1.0028 1.0021 0.9996 1.0400 0.9536 3.9660 1.0141 1.0142 1.0133 3.7518 1.0045 3.9476 1.0106 1.0098 1.0161 1.8925 1.0108 3.7630 2.3925 3.9503 1.0100 1.0080 1.0077 3.9432 1.0060 1.0130 1.0040 0.9882 1.0187 0.9936
e0: -1719.762078721 hartree
corrType: DLPNO BASED
energy: -1727.124338991217
dipole: -173.70488 174.31759 0.61272 -108.25418 110.34643 2.09226 63.44739 -60.38725 3.06014
magnitude: 3.75732 au
magnitude: 9.55034 debye
