program: Orca
programVersion: 5.0.2
elementType: C C C C C C C H H C C H H O O O O O H C H H C H C H H H C H H H C H C C H H H C H H H C H C C H H H C H H H H Ag C H H H C H C H H H O H H
elementType: Ag
charge: 1
multiplicity: 1
keywords: wB97X-D3 OptTS Freq def2-TZVPP def2/J RIJCOSX TightSCF defgrid3
frequency: 0.00 0.00 0.00 0.00 0.00 0.00 -227.09 17.08 24.99 30.83 32.75 37.42 47.26 49.51 54.95 66.24 77.69 90.58 92.54 97.87 102.40 116.49 119.57 123.15 130.59 146.78 159.69 161.72 169.95 184.81 190.36 195.36 211.91 217.33 220.89 228.65 230.56 234.24 248.51 263.31 267.83 279.16 290.55 301.38 317.19 329.04 341.03 354.09 365.24 370.95 383.39 392.49 404.93 413.29 414.25 422.30 443.53 453.02 466.88 473.92 483.42 490.66 515.18 519.14 537.85 563.06 577.97 581.17 623.11 660.69 711.67 745.27 762.42 778.66 800.19 812.97 815.25 829.72 861.80 878.73 887.09 909.54 921.01 924.15 926.47 940.40 943.73 958.16 960.87 967.34 974.03 974.37 983.39 986.68 1010.61 1025.54 1033.95 1036.07 1050.35 1069.93 1091.50 1097.30 1101.14 1105.16 1105.60 1117.69 1122.44 1134.63 1154.56 1163.13 1176.95 1189.36 1201.44 1207.41 1215.24 1242.52 1253.68 1270.35 1276.90 1285.39 1317.73 1320.15 1323.20 1331.94 1351.21 1370.46 1377.74 1379.29 1392.45 1394.15 1406.38 1409.20 1418.53 1424.58 1425.18 1427.55 1434.01 1435.97 1436.28 1438.44 1440.99 1449.76 1459.82 1463.03 1468.50 1476.53 1477.37 1484.51 1487.67 1488.50 1489.07 1494.49 1494.64 1496.73 1497.51 1500.41 1504.83 1505.22 1509.61 1510.02 1510.37 1514.13 1534.85 1615.00 1647.09 1662.05 1671.74 1682.30 1752.25 1803.90 2883.96 3051.94 3055.55 3055.84 3057.13 3058.52 3063.37 3063.75 3063.94 3069.56 3073.58 3092.81 3095.87 3095.93 3120.37 3122.31 3123.08 3124.07 3129.90 3130.15 3130.66 3135.58 3138.59 3140.40 3150.17 3150.26 3153.57 3154.82 3155.57 3162.69 3163.95 3166.22 3166.28 3168.46 3169.68 3719.80 3720.58
frequency: 17.08 24.99 30.83 32.75 37.42 47.26 49.51 54.95 66.24 77.69 90.58 92.54 97.87 102.40 116.49 119.57 123.15 130.59 146.78 159.69 161.72 169.95 184.81 190.36 195.36 211.91 217.33 220.89 228.65 230.56 234.24 248.51 263.31 267.83 279.16 290.55 301.38 317.19 329.04 341.03 354.09 365.24 370.95 383.39 392.49 404.93 413.29 414.25 422.30 443.53 453.02 466.88 473.92 483.42 490.66 515.18 519.14 537.85 563.06 577.97 581.17 623.11 660.69 711.67 745.27 762.42 778.66 800.19 812.97 815.25 829.72 861.80 878.73 887.09 909.54 921.01 924.15 926.47 940.40 943.73 958.16 960.87 967.34 974.03 974.37 983.39 986.68 1010.61 1025.54 1033.95 1036.07 1050.35 1069.93 1091.50 1097.30 1101.14 1105.16 1105.60 1117.69 1122.44 1134.63 1154.56 1163.13 1176.95 1189.36 1201.44 1207.41 1215.24 1242.52 1253.68 1270.35 1276.90 1285.39 1317.73 1320.15 1323.20 1331.94 1351.21 1370.46 1377.74 1379.29 1392.45 1394.15 1406.38 1409.20 1418.53 1424.58 1425.18 1427.55 1434.01 1435.97 1436.28 1438.44 1440.99 1449.76 1459.82 1463.03 1468.50 1476.53 1477.37 1484.51 1487.67 1488.50 1489.07 1494.49 1494.64 1496.73 1497.51 1500.41 1504.83 1505.22 1509.61 1510.02 1510.37 1514.13 1534.85 1615.00 1647.09 1662.05 1671.74 1682.30 1752.25 1803.90 2883.96 3051.94 3055.55 3055.84 3057.13 3058.52 3063.37 3063.75 3063.94 3069.56 3073.58 3092.81 3095.87 3095.93 3120.37 3122.31 3123.08 3124.07 3129.90 3130.15 3130.66 3135.58 3138.59 3140.40 3150.17 3150.26 3153.57 3154.82 3155.57 3162.69 3163.95 3166.22 3166.28 3168.46 3169.68 3719.80 3720.58
formula: C24H38O6Ag
InChI: InChI=1S/C21H29O5.C3H9O.Ag/c1-12(2)7-8-15-18(23)17(16(22)11-14(5)6)20(25)21(26,19(15)24)10-9-13(3)4;1-3(2)4;/h7,9,14,22,26H,8,10-11H2,1-6H3;3H,4H2,1-2H3;
69 atoms
C  1.729172 -0.301155 -1.96849
C  1.460651 -1.360761 -1.020211
C  0.091485 -1.864879 -0.908978
C  -0.933949 -1.387327 -1.825646
C  -0.750993 -0.178641 -2.544785
C  0.546845 0.600205 -2.367311
C  -2.358225 -1.876625 -1.623354
H  -2.883754 -1.938737 -2.574778
H  -2.316324 -2.885986 -1.21051
C  2.46287 -1.936706 -0.236754
C  3.888543 -1.502222 -0.204568
H  4.448571 -2.277498 0.320036
H  4.265704 -1.415101 -1.221079
O  2.176939 -2.889862 0.59387
O  -0.189976 -2.753938 -0.083531
O  -1.618703 0.271093 -3.317314
O  2.806369 -0.018901 -2.46317
O  0.856743 1.270031 -3.549567
H  1.824089 1.254891 -3.599611
C  0.354005 1.612926 -1.20175
H  0.268106 1.07969 -0.254014
H  1.280201 2.194817 -1.153656
C  4.07864 -0.153175 0.520417
H  3.509863 0.602487 -0.028602
C  3.564394 -0.20229 1.955679
H  4.090289 -0.964566 2.534244
H  2.497722 -0.431356 2.004255
H  3.720382 0.756973 2.450397
C  5.550276 0.240466 0.468522
H  6.169006 -0.495097 0.987373
H  5.709918 1.205618 0.950292
H  5.904397 0.314774 -0.56034
C  -3.154046 -1.04124 -0.648234
H  -2.760724 -1.038808 0.366747
C  -4.389711 -0.500691 -0.841922
C  -5.149808 -0.613878 -2.13783
H  -5.808199 -1.485009 -2.093541
H  -5.788632 0.255901 -2.291363
H  -4.50145 -0.71985 -3.004743
C  -5.195724 0.008928 0.327896
H  -4.600776 0.093565 1.236335
H  -6.008519 -0.69458 0.524723
H  -5.66487 0.970681 0.116156
C  -0.791239 2.565747 -1.423443
H  -0.930747 2.876281 -2.455758
C  -1.483799 3.230625 -0.458311
C  -1.217444 3.076072 1.014969
H  -2.140228 3.138566 1.591652
H  -0.584226 3.903772 1.344729
H  -0.708017 2.149879 1.271429
C  -2.386392 4.381697 -0.823787
H  -1.905872 5.315337 -0.521345
H  -3.338118 4.337115 -0.292643
H  -2.576615 4.434674 -1.894738
H  1.182382 -3.058742 0.522295
Ag -2.728371 1.239076 -1.170726
C  0.405324 -2.207707 -6.482983
H  0.006272 -3.18077 -6.768309
H  1.365942 -2.070245 -6.97798
H  -0.262177 -1.423672 -6.843194
C  0.608526 -2.122506 -4.992238
H  0.951006 -1.125833 -4.703562
C  1.481752 -3.199475 -4.403002
H  1.547421 -3.114596 -3.317745
H  1.109676 -4.190025 -4.662872
H  2.489369 -3.089962 -4.80165
O  -0.741468 -2.282185 -4.355923
H  -0.681204 -2.05312 -3.284951
H  -1.329774 -1.580874 -4.680848
totalener: -1535.75122290 hartree
nucrepener: 3884.37106298 hartree
electener: -5420.12228589 hartree
oneelecener: -9858.00462133 hartree
twoeener: 4437.88233545 hartree
kineticenergy: 1438.76829351 hartree
xcener: -144.202498030848 hartree
temp: 298.15 k
press: 1.00 atm
thermalcorrenthalpy: 0.00094421 hartree
totalenthalpy: -1535.17049671 hartree
totalentropycorr: -0.09942831 hartree
gibbsenthalpy: -1535.26992501 hartree
gibbsminuselec: 0.52712289 hartree
chargesum: 1.0000000
charge: 0.083400 -0.353056 0.262409 -0.054174 -0.126719 0.634051 -0.196169 0.100877 0.130222 0.291283 -0.137884 0.112216 0.118985 -0.251558 -0.434808 -0.440216 -0.379041 -0.367587 0.211106 -0.296697 0.123964 0.123530 0.003089 0.042746 -0.249953 0.096192 0.074887 0.093223 -0.265053 0.090537 0.089737 0.095919 -0.151532 0.178537 0.091812 -0.224249 0.133599 0.099491 0.092791 -0.205231 0.093537 0.126071 0.093622 -0.139810 0.189260 0.046861 -0.219453 0.102064 0.132533 0.093389 -0.196174 0.123876 0.094293 0.098748 0.240219 0.137499 -0.215920 0.108283 0.102841 0.097945 0.022606 0.116343 -0.215210 0.095842 0.111358 0.114200 -0.098923 0.269141 0.234283
charge: -0.273386 -0.145850 -0.262588 -0.131957 -0.316801 -0.254297 -0.008390 0.025636 0.045870 -0.126060 0.006257 0.041358 0.034167 0.424794 0.154999 0.076319 0.141574 0.320235 -0.137515 0.007631 0.036380 0.048671 -0.100351 0.021890 0.012748 0.021832 0.008417 0.016782 0.018620 0.018802 0.017047 0.017357 -0.000932 0.042936 -0.102602 0.033903 0.035528 0.030106 0.022662 0.031748 0.027734 0.036381 0.025717 -0.007899 0.049246 -0.097546 0.035205 0.029880 0.037673 0.021944 0.034943 0.035963 0.026603 0.030215 -0.172516 0.362882 0.026559 0.027090 0.035933 0.021844 -0.095565 0.025920 0.029097 0.020955 0.027246 0.036407 0.615923 -0.057639 -0.043735
qa: 0.0834 -0.3531 0.2624 -0.0542 -0.1267 0.6341 -0.1962 0.1009 0.1302 0.2913 -0.1379 0.1122 0.1190 -0.2516 -0.4348 -0.4402 -0.3790 -0.3676 0.2111 -0.2967 0.1240 0.1235 0.0031 0.0427 -0.2500 0.0962 0.0749 0.0932 -0.2651 0.0905 0.0897 0.0959 -0.1515 0.1785 0.0918 -0.2242 0.1336 0.0995 0.0928 -0.2052 0.0935 0.1261 0.0936 -0.1398 0.1893 0.0469 -0.2195 0.1021 0.1325 0.0934 -0.1962 0.1239 0.0943 0.0987 0.2402 0.1375 -0.2159 0.1083 0.1028 0.0979 0.0226 0.1163 -0.2152 0.0958 0.1114 0.1142 -0.0989 0.2691 0.2343
va: 4.0149 3.2626 3.9856 3.2928 3.9390 3.4695 4.0800 1.0008 1.0220 3.8618 3.8087 1.0254 1.0268 2.3075 2.0881 1.9988 2.0823 2.1213 1.0606 3.9736 1.0029 1.0167 3.8761 1.0169 3.9210 1.0097 1.0093 1.0056 3.9468 1.0047 1.0069 1.0045 3.7611 1.0224 3.6612 3.9276 0.9951 1.0094 1.0156 3.9381 1.0074 0.9964 1.0038 3.6180 1.0353 3.7875 3.9337 1.0050 0.9967 1.0072 3.9356 0.9980 1.0037 1.0092 1.1045 1.6508 3.9506 1.0044 1.0086 1.0076 3.8406 1.0248 3.9125 1.0099 1.0085 1.0082 2.4326 1.0711 1.0221
dispcorr: -0.045764773 hartree
energy: -1535.797070867055
dipole: 162.63673 -164.26496 -1.62822 -87.56879 88.02534 0.45655 -16.69158 15.81292 -0.87866
magnitude: 1.90567 au
magnitude: 4.84383 debye
zeropoint: 0.58911523 hartree
thermalvibcorrection: 0.03355999 hartree
thermalrotcorrection: 0.00141627 hartree
thermaltrasncorrection: 0.00141627 hartree
thermaltotal: -1535.17156310 hartree
thermalcorr: 0.03639253 hartree
nonthermalcorr: 0.58911523 hartree
totalcorr: 0.62550776 hartree
totalenthalpy: -1535.17061889 hartree
