program: Orca
programVersion: 5.0.2
elementType: C C C C C C C H H C C H H O O O O O H C H H C H C H H H C H H H C H C C H H H C H H H C H C C H H H C H H H H Ag C H H H C H C H H H O H C O H C H H H C O C H H H C H H H H C H H H H H H
elementType: Ag
charge: 1
multiplicity: 1
keywords: DLPNO-CCSD(T) def2-TZVPP def2-TZVPP/C VeryTightSCF
formula: C30H54O8Ag
InChI: InChI=1S/C21H30O5.3C3H8O.Ag/c1-12(2)7-8-15-18(23)17(16(22)11-14(5)6)20(25)21(26,19(15)24)10-9-13(3)4;3*1-3(2)4;/h7,9,14,22,24,26H,8,10-11H2,1-6H3;3*3-4H,1-2H3;
93 atoms
C  -1.631156 -1.391639 -0.624204
C  -2.507105 -0.464165 -1.294328
C  -2.679871 0.858696 -0.723816
C  -2.077858 1.207149 0.571744
C  -1.45524 0.266371 1.302545
C  -1.321732 -1.163798 0.861251
C  -2.135939 2.659869 0.976489
H  -3.086658 3.074958 0.637406
H  -2.102436 2.769171 2.056095
C  -3.106089 -0.754001 -2.529048
C  -3.078809 -2.07883 -3.207557
H  -3.464971 -1.931891 -4.216994
H  -2.050719 -2.430848 -3.264595
O  -3.801004 0.147879 -3.142457
O  -3.307593 1.742857 -1.331595
O  -0.892932 0.492265 2.499159
O  -1.099147 -2.372916 -1.119053
O  0.021712 -1.574735 1.07271
H  0.113618 -2.362993 0.516752
C  -2.312841 -2.069703 1.64052
H  -3.326339 -1.751669 1.392962
H  -2.190069 -3.071778 1.217493
C  -3.932865 -3.137016 -2.476933
H  -3.52953 -3.252808 -1.467529
C  -5.3931 -2.708882 -2.372325
H  -5.5112 -1.776485 -1.816543
H  -5.979088 -3.472804 -1.860622
H  -5.829788 -2.561179 -3.362377
C  -3.79339 -4.474451 -3.194511
H  -4.367512 -5.247925 -2.683625
H  -2.752215 -4.797149 -3.232259
H  -4.165326 -4.408341 -4.219481
C  -1.035841 3.471667 0.329108
H  -1.061373 3.484153 -0.757629
C  -0.19648 4.347824 0.951085
C  0.63194 5.312693 0.138793
H  0.208561 6.314976 0.240948
H  1.659657 5.370607 0.500171
H  0.641569 5.059629 -0.920509
C  -0.220747 4.630734 2.43045
H  0.788412 4.794802 2.80849
H  -0.676997 3.837883 3.018614
H  -0.78207 5.552251 2.605535
C  -2.088205 -2.134648 3.118661
H  -1.138874 -2.568765 3.414708
C  -2.929958 -1.762342 4.079758
C  -2.581307 -1.979149 5.524705
H  -2.601369 -1.036754 6.078774
H  -1.595636 -2.426614 5.64286
H  -3.3121 -2.635174 6.003624
C  -4.270042 -1.124278 3.852677
H  -5.072649 -1.777568 4.202496
H  -4.467529 -0.876543 2.81189
H  -4.346229 -0.202875 4.436083
H  -3.767219 0.987258 -2.581028
Ag 0.940124 2.266948 0.684189
C  3.9361 2.308396 2.672446
H  4.957641 2.16721 3.023428
H  3.627572 3.323246 2.92492
H  3.935526 2.19858 1.584516
C  3.009186 1.291945 3.301703
H  3.028153 1.411909 4.390167
C  3.360152 -0.138388 2.942239
H  2.638135 -0.838171 3.368261
H  3.366996 -0.267801 1.859541
H  4.343992 -0.397372 3.333569
O  1.679274 1.617955 2.859932
H  1.074636 0.891757 3.045252
C  2.225131 0.130994 -1.431687
O  1.737901 0.312685 -0.088235
H  1.196522 -0.437308 0.217408
C  1.095337 0.225656 -2.438238
H  0.591011 1.192239 -2.355218
H  1.481611 0.131951 -3.453297
H  0.362818 -0.566549 -2.286663
C  -1.807655 1.959215 5.659544
O  -2.206599 2.030049 4.272769
C  -1.837002 3.341882 6.279654
H  -2.831615 3.786018 6.213146
H  -1.568613 3.290294 7.33491
H  -1.128906 4.001544 5.775819
C  -0.435526 1.323494 5.685592
H  -0.09107 1.217008 6.713331
H  -0.459715 0.332404 5.230037
H  0.280902 1.946956 5.146231
H  -2.518806 1.307368 6.176743
C  3.295261 1.178996 -1.644271
H  3.737901 1.082296 -2.6347
H  2.865073 2.183456 -1.570756
H  4.087245 1.083078 -0.902194
H  2.67773 -0.863513 -1.476632
H  -3.123536 2.30124 4.219117
H  -1.403674 1.123934 3.052208
totalener: -1913.02921949 hartree
nucrepener: 5716.48664572 hartree
electener: -7629.51586521 hartree
twoeener: 6405.31842234 hartree
kineticenergy: 1822.43769688 hartree
chargesum: 1.0000000
charge: 0.160943 -0.346848 0.400433 -0.015231 0.024672 0.854150 -0.089337 0.137323 0.059891 0.416642 -0.141616 0.120954 0.114077 -0.371123 -0.560211 -0.519548 -0.547819 -0.492941 0.238098 -0.160587 0.102353 0.111288 0.112196 0.006259 -0.214921 0.055969 0.075471 0.071278 -0.232486 0.072905 0.074704 0.066952 -0.294057 0.153779 0.146243 -0.188987 0.106538 0.070468 0.074559 -0.173816 0.076375 0.030226 0.115434 -0.145112 0.068450 -0.014251 -0.185925 0.041652 0.074794 0.092281 -0.206240 0.097011 0.058112 0.044389 0.301598 0.589833 -0.213031 0.094566 0.073024 0.025341 0.289073 0.050123 -0.212042 0.065190 0.052918 0.088418 -0.510837 0.253772 0.282789 -0.557552 0.279497 -0.203657 0.031908 0.097531 0.061275 0.258882 -0.484059 -0.187177 0.062612 0.080792 0.061623 -0.237859 0.097877 0.069489 0.059642 0.051563 -0.216414 0.097305 0.020694 0.083658 0.069273 0.226569 0.319982
charge: -0.224556 -0.148796 -0.182450 -0.085508 -0.130793 -0.197014 0.008389 0.039987 0.018222 -0.050451 0.021354 0.036692 0.032028 0.384593 0.101226 0.355985 0.061337 0.304843 -0.117202 0.004951 0.028204 0.035505 -0.084409 0.018124 0.026514 0.004751 0.012404 0.015151 0.030937 0.012296 0.011515 0.012615 0.000423 0.034143 -0.080356 0.043198 0.027890 0.019754 0.022371 0.042468 0.023417 0.012308 0.026672 -0.022067 0.014575 -0.091947 0.027568 0.007206 0.015701 0.018859 0.026007 0.021184 0.006145 0.009046 -0.158943 0.291383 0.028518 0.019901 0.012280 0.012142 -0.152220 0.012541 0.024326 0.009480 0.011418 0.017372 0.286742 -0.136787 -0.146927 0.292468 -0.151559 0.027104 0.011872 0.020068 0.012312 -0.151343 0.297101 0.024504 0.008989 0.019549 0.011861 0.021571 0.019771 0.010928 0.011648 0.009819 0.030206 0.020986 0.012940 0.014051 0.018834 -0.132583 -0.153329
qa: 0.1609 -0.3468 0.4004 -0.0152 0.0247 0.8542 -0.0893 0.1373 0.0599 0.4166 -0.1416 0.1210 0.1141 -0.3711 -0.5602 -0.5195 -0.5478 -0.4929 0.2381 -0.1606 0.1024 0.1113 0.1122 0.0063 -0.2149 0.0560 0.0755 0.0713 -0.2325 0.0729 0.0747 0.0670 -0.2941 0.1538 0.1462 -0.1890 0.1065 0.0705 0.0746 -0.1738 0.0764 0.0302 0.1154 -0.1451 0.0684 -0.0143 -0.1859 0.0417 0.0748 0.0923 -0.2062 0.0970 0.0581 0.0444 0.3016 0.5898 -0.2130 0.0946 0.0730 0.0253 0.2891 0.0501 -0.2120 0.0652 0.0529 0.0884 -0.5108 0.2538 0.2828 -0.5576 0.2795 -0.2037 0.0319 0.0975 0.0613 0.2589 -0.4841 -0.1872 0.0626 0.0808 0.0616 -0.2379 0.0979 0.0695 0.0596 0.0516 -0.2164 0.0973 0.0207 0.0837 0.0693 0.2266 0.3200
va: 4.1316 3.2468 3.9210 3.3545 3.9210 3.1021 3.8598 1.0125 1.0127 3.7655 3.8503 1.0163 1.0204 2.1708 1.9185 1.8909 1.8691 1.9329 1.0249 3.8968 1.0027 1.0211 3.8027 1.0289 3.9627 1.0075 1.0050 1.0121 3.9685 1.0072 1.0044 1.0070 3.8269 1.0212 3.6286 3.9527 1.0000 1.0069 1.0073 3.9576 1.0128 1.0107 0.9978 3.7921 1.0284 3.6980 3.9655 0.9928 1.0061 1.0034 3.9760 1.0047 1.0034 1.0026 1.0387 0.8764 3.9592 1.0160 1.0100 1.0062 3.7171 1.0026 3.9730 1.0103 1.0130 1.0147 1.8502 1.0003 3.7010 1.8218 1.0223 3.9681 1.0118 1.0156 1.0216 3.7439 1.8634 3.9915 1.0109 1.0147 1.0041 3.9520 1.0149 1.0055 1.0108 0.9969 3.9577 1.0148 1.0105 1.0071 1.0038 1.0074 0.9784
e0: -1913.029219323 hartree
corrType: DLPNO BASED
energy: -1921.238020099351
dipole: -113.52819 114.27223 0.74404 -116.94659 118.18221 1.23562 40.26277 -38.68355 1.57922
magnitude: 2.13876 au
magnitude: 5.43629 debye
