program: Gaussian 09
title: 000037450
version: EM64L-G09RevD.01
frameworkgroup: C1[X(C15H36N2)]
method: RPBEPBE
basis: SDD
operation: Freq
keyword: #p
keyword: freq=noraman
keyword: PBEPBE/SDD
title: #p freq=noraman PBEPBE/SDD
converged: YES YES NO NO
title: Mulliken charges:
elementType: N N C C C C C C C C C C C C C C C H H H H H H H H H H H H H H H H H H H H H H H H H H H H H H H H H H H H
charge: -0.113569 -0.113576 -0.348250 -0.348232 -0.410920 -0.410985 -0.373807 -0.373796 -0.391678 -0.391695 -0.386771 -0.553651 -0.554836 -0.542503 -0.542530 -0.553562 -0.554917 0.268338 0.268147 0.268359 0.268134 0.233130 0.231186 0.231107 0.233235 0.212231 0.212127 0.212255 0.212095 0.207730 0.208788 0.207734 0.208791 0.208271 0.207644 0.269352 0.270644 0.270307 0.272356 0.268845 0.270517 0.270831 0.270105 0.270009 0.270843 0.270019 0.270107 0.270544 0.269382 0.270300 0.268828 0.272454 0.270530
chargesum: 2.00000
title: Mulliken charges with hydrogens summed into heavy atoms:
elementType: N N C C C C C C C C C C C C C C C
charge: -0.113569 -0.113576 0.188236 0.188261 0.053396 0.053357 0.050550 0.050554 0.024841 0.024830 0.029144 0.256651 0.256882 0.268442 0.268440 0.256664 0.256895
polarizability: 2.24803701e+02 -3.75862780e-04 1.49405501e+02 3.08897584e-03 5.95925423e-02 1.46018329e+02
1716.lowfreq: -6.0615 -0.0016 0.0015 0.0023 6.9889 18.1322 21.9271 24.9467 26.6348
frequency: 21.7092 24.1240 25.5047 51.8681 63.5158 76.8547 86.4594 89.5463 120.3991 120.6334 128.6611 152.6592 155.0643 156.3616 196.6867 197.2459 229.7898 253.3931 256.4734 264.9025 265.4113 283.4852 303.2504 338.3722 338.4437 354.2185 384.8262 411.6529 427.9397 428.3443 429.1013 475.2606 482.2744 510.2669 526.7091 726.7845 729.1422 729.6225 736.4304 749.8250 772.4056 813.8302 860.6905 862.9284 877.7642 920.8829 933.5915 934.6250 935.0270 967.7903 989.1120 994.0248 1022.5507 1035.3134 1037.4239 1040.2233 1040.4946 1061.7619 1067.8134 1076.7418 1076.7726 1079.8888 1081.5843 1113.3552 1123.8601 1150.1767 1154.4137 1197.6426 1208.0290 1216.9717 1223.6679 1232.6807 1245.4393 1246.1593 1247.5935 1263.8964 1273.3887 1292.9850 1294.8668 1297.6235 1305.5691 1313.3242 1323.6941 1324.0480 1324.9708 1348.6632 1358.8255 1360.8681 1372.0368 1372.0815 1419.1786 1419.2822 1419.7270 1419.8994 1445.6062 1445.7561 1452.6041 1452.6401 1457.4450 1457.6246 1464.9392 1465.4056 1466.4125 1466.5517 1468.2960 1469.1148 1469.8190 1472.7824 1479.2585 1484.4939 1485.3954 1485.4080 1486.1723 1487.6015 1491.1615 1500.6683 1500.9101 2962.4502 2964.5398 2968.1323 2973.3269 2977.7975 2994.9736 2995.1306 3000.4115 3009.3183 3014.6871 3014.7235 3020.1961 3024.3427 3024.3850 3027.7294 3027.8495 3031.1756 3031.2212 3034.5281 3047.5005 3059.2536 3061.3657 3091.1249 3091.2017 3141.0434 3141.0641 3141.9628 3141.9983 3144.6017 3144.6091 3147.4093 3147.4774 3153.3734 3153.4284 3156.9371 3156.9865
redmass: 2.6077 3.7440 3.8240 3.1382 1.6512 3.5013 2.3972 1.6053 1.8412 1.7829 4.0887 1.8640 1.9587 3.2985 1.2365 1.2598 3.2058 1.1673 1.0420 1.0724 1.0567 2.5417 2.9574 2.1990 2.2000 2.7087 2.7295 2.8432 2.4251 2.2709 2.5758 2.5813 2.9737 2.7225 2.9611 4.2002 1.1120 3.5242 1.0816 1.1083 1.1726 1.2700 3.3853 3.3552 1.4350 2.3398 2.3589 2.6092 2.8374 1.3356 4.4838 4.8371 1.1774 3.3733 3.8519 1.1958 1.1966 2.4760 2.7473 1.2288 2.3150 2.0216 1.1709 1.5261 2.0174 1.4647 1.3441 1.6768 1.3896 1.7139 1.6683 1.5583 1.8533 1.8649 1.5919 1.3706 1.3938 1.0206 1.3170 1.2373 1.0529 1.1025 1.2228 1.3110 1.2032 1.3761 1.4620 1.5319 1.3107 1.3208 1.1463 1.1456 1.1455 1.1460 1.1030 1.1025 1.0471 1.0472 1.1118 1.1121 1.0738 1.0714 1.0405 1.0403 1.0718 1.0505 1.0524 1.0914 1.0924 1.0744 1.0548 1.0549 1.0633 1.0814 1.0967 1.0609 1.0615 1.0591 1.0589 1.0593 1.0592 1.0586 1.0586 1.0586 1.0980 1.1001 1.0579 1.0579 1.1022 1.0322 1.0322 1.0333 1.0327 1.0336 1.0336 1.1032 1.1047 1.1051 1.1050 1.1078 1.1078 1.1055 1.1055 1.1059 1.1059 1.1052 1.1052 1.1053 1.1053 1.1053 1.1052 1.1048 1.1048
irintensity: 0.0098 4.2494 4.5021 0.0003 0.1716 0.0167 0.2922 0.0005 0.0128 0.0370 0.1204 0.0140 0.0002 0.2353 0.0264 0.3507 0.3173 0.0068 0.1345 0.0267 0.0240 1.7344 0.6758 0.2576 0.1776 0.1533 0.0577 0.0712 0.2718 0.2648 0.3868 0.0047 0.4303 0.3244 2.7638 0.3617 14.8890 0.6771 0.0251 10.5761 0.0482 4.4296 94.9683 0.6030 0.0366 24.3625 1.2783 2.6097 30.2054 3.8014 1.1918 14.3078 0.0143 0.2469 0.1785 0.0042 0.0005 10.8729 0.1503 0.0065 0.4969 0.0793 0.0007 8.8236 1.8925 0.0761 0.0258 0.0060 22.0197 0.2020 0.0063 11.7453 0.2218 0.0213 0.0710 0.6153 0.0025 0.0179 12.0026 0.0103 1.1235 0.0006 0.0012 0.8152 0.0394 8.0408 2.7586 0.3558 3.8463 3.6261 16.0904 20.9877 16.5393 18.6569 2.7476 1.5177 0.0519 0.0488 10.0005 8.0050 0.0005 1.4164 0.3887 0.6916 0.1081 0.7903 0.4138 1.9941 6.8566 15.6502 1.0059 88.3684 33.9197 65.2858 21.6981 88.3648 86.5509 0.0586 0.6880 0.1988 0.5567 96.2672 4.8985 41.7681 0.0172 0.0004 3.6174 23.9655 0.4515 4.0263 4.2979 0.2127 4.8978 1.0561 1.0619 0.0013 30.9894 0.0024 102.7071 1.8595 45.5600 0.5167 0.5900 0.2471 0.2655 2.5930 4.8909 8.7564 7.5207 0.9174 0.9237 7.1552 7.0792
temp: 298.150 k
press: 1.00000 atm
elementType: 7 7 6 6 6 6 6 6 6 6 6 6 6 6 6 6 6 1 1 1 1 1 1 1 1 1 1 1 1 1 1 1 1 1 1 1 1 1 1 1 1 1 1 1 1 1 1 1 1 1 1 1 1
symmnumber: 1
zpe: 1308270.2 jmol-1
zpe.correction: 0.498294 hartree
zpe.thermalcorrener: 0.521581 hartree
zpe.thermalcorrenthalpy: 0.522525 hartree
zpe.thermalcorrgfe: 0.444047 hartree
zpe.sumelectzpe: -700.693479 hartree
zpe.sumelectthermal: -700.670192 hartree
zpe.sumelectthermalent: -700.669248 hartree
zpe.sumelectthermalfe: -700.747726 hartree
dipole: 0.0001 -0.4058 0.0919
dipole: 0.4161
quadrupole: 294.2429 -95.2181 -93.9202
quadrupole: -0.0020 -0.0028 -0.0190
quadrupole: 259.2080 -130.2529 -128.9550 -0.0020 -0.0028 -0.0190
hfenergy: -701.1917728 hartree
pointgroup: C01 [X(C15H36N2)]
dipole: 0.0001117 0.1572182 0.0455627 debye
polarizability: 224.80364|-0.0575738|149.4006489|-0.0361468|0.1418352|146.0232412 unknown
InChI: InChI=1S/C15H36N2/c1-16(2,3)14-12-10-8-7-9-11-13-15-17(4,5)6/h7-15H2,1-6H3
charge 2 multiplicity 1
53 atoms
N  -6.490907 0.091391 0.018683
N  6.492041 0.081413 0.013344
C  -5.099771 -0.604463 -0.051313
C  5.09972 -0.611785 -0.058771
C  -3.871008 0.318696 0.00315
C  3.87253 0.313217 -0.000605
C  -2.573138 -0.535143 -0.045754
C  2.57333 -0.538678 -0.048908
C  -1.290357 0.330539 -0.012503
C  1.291799 0.328759 -0.013408
C  0.000114 -0.523121 -0.047727
C  -6.660069 0.834063 1.343023
C  -6.669198 1.06861 -1.141576
C  -7.565938 -0.994787 -0.07904
C  7.565165 -1.005988 -0.091598
C  6.663872 0.816588 1.341531
C  6.670412 1.064769 -1.141713
H  -5.084204 -1.318893 0.791519
H  -5.105605 -1.182929 -0.992854
H  5.083208 -1.329321 0.781397
H  5.104244 -1.186756 -1.002461
H  -3.86388 1.021076 -0.851393
H  -3.862333 0.918434 0.932751
H  3.866197 0.911451 0.929994
H  3.86519 1.016965 -0.854009
H  -2.560599 -1.238342 0.811586
H  -2.570645 -1.154913 -0.965392
H  2.560779 -1.242701 0.807747
H  2.568914 -1.157503 -0.969172
H  -1.29122 0.957676 0.90239
H  -1.293191 1.028502 -0.874459
H  1.294625 0.955149 0.90199
H  1.29455 1.02739 -0.874825
H  -0.000627 -1.151107 -0.962242
H  -0.00007 -1.222483 0.813403
H  -7.682714 1.238023 1.396259
H  -5.936371 1.659022 1.398994
H  -6.494384 0.131095 2.173659
H  -5.943908 1.888313 -1.04608
H  -7.691586 1.475378 -1.109695
H  -6.510802 0.533943 -2.09059
H  -8.560345 -0.525796 -0.026993
H  -7.443678 -1.700783 0.756475
H  -7.455439 -1.526556 -1.036292
H  8.560414 -0.539063 -0.037273
H  7.453223 -1.531786 -1.051975
H  7.442154 -1.716834 0.73969
H  5.941249 1.642119 1.402955
H  7.687046 1.219098 1.395607
H  6.49849 0.109289 2.16853
H  7.693519 1.469652 -1.108942
H  5.94659 1.885103 -1.040625
H  6.509815 0.535708 -2.093489
