program: Orca
programVersion: 5.0.2
elementType: C C C C C C C H H C C H H O O O O O H C H H C H C H H H C H H H C H C C H H H C H H H C H C C H H H C H H H H Ag C H H H C H C H H H O H H
elementType: Ag
charge: 1
multiplicity: 1
keywords: DLPNO-CCSD(T) def2-TZVPP def2-TZVPP/C VeryTightSCF
formula: C24H38O6Ag
InChI: InChI=1S/C21H30O5.C3H8O.Ag/c1-12(2)7-8-15-18(23)17(16(22)11-14(5)6)20(25)21(26,19(15)24)10-9-13(3)4;1-3(2)4;/h7,9,14-15,22,26H,8,10-11H2,1-6H3;3-4H,1-2H3;
69 atoms
C  -2.440099 -1.154625 -0.781343
C  -3.478176 -0.183788 -1.077728
C  -3.654358 0.965595 -0.22816
C  -2.797016 1.185566 1.014473
C  -1.654724 0.211369 1.186887
C  -1.850121 -1.182325 0.641434
C  -2.328136 2.643732 1.125793
H  -3.218164 3.272611 1.184933
H  -1.784966 2.758255 2.059816
C  -4.314382 -0.314804 -2.209059
C  -4.332003 -1.473718 -3.138746
H  -4.911446 -1.176555 -4.013486
H  -3.314992 -1.711866 -3.441714
O  -5.192647 0.592286 -2.469682
O  -4.487714 1.845158 -0.473615
O  -0.630353 0.534834 1.737829
O  -2.005351 -1.995074 -1.544433
O  -0.60949 -1.835804 0.585021
H  -0.689536 -2.431867 -0.177619
C  -2.855611 -1.951531 1.545891
H  -3.858132 -1.551627 1.394919
H  -2.866209 -2.975609 1.161838
C  -4.973772 -2.726686 -2.498225
H  -4.386397 -2.989545 -1.614643
C  -6.413911 -2.46788 -2.067941
H  -6.487779 -1.678769 -1.316744
H  -6.849606 -3.369876 -1.638054
H  -7.031089 -2.17293 -2.91911
C  -4.883711 -3.885935 -3.483623
H  -5.306571 -4.792137 -3.049541
H  -3.84892 -4.094361 -3.757584
H  -5.439494 -3.66535 -4.397612
C  -1.52413 3.140312 -0.05127
H  -1.98301 2.981988 -1.025632
C  -0.486403 4.02901 -0.007962
C  -0.060983 4.768716 -1.251618
H  -0.412484 5.800848 -1.176478
H  1.023974 4.816497 -1.348861
H  -0.482029 4.33672 -2.158241
C  0.094984 4.555974 1.276973
H  1.157722 4.770519 1.165499
H  -0.037251 3.882208 2.120646
H  -0.393224 5.502561 1.522907
C  -2.451334 -1.926508 2.986254
H  -1.460715 -2.321547 3.186417
C  -3.167369 -1.473331 4.014643
C  -2.611766 -1.523835 5.408716
H  -2.590313 -0.525644 5.852337
H  -1.602758 -1.931368 5.429182
H  -3.244531 -2.13989 6.051594
C  -4.554995 -0.905439 3.922923
H  -5.244358 -1.504051 4.521937
H  -4.954984 -0.864598 2.91137
H  -4.580668 0.103056 4.343268
H  -5.129606 1.301978 -1.755951
Ag 0.402839 1.854324 -0.301604
C  2.840452 -0.307095 1.460127
H  3.868337 -0.507635 1.761864
H  2.202158 -1.079801 1.889415
H  2.539902 0.653909 1.883799
C  2.733379 -0.286664 -0.05079
H  3.04847 -1.249083 -0.462047
C  3.530731 0.821414 -0.698203
H  3.403784 0.817154 -1.780306
H  3.219062 1.79743 -0.306147
H  4.591313 0.709699 -0.477107
O  1.35495 -0.103062 -0.455422
H  0.783744 -0.746414 0.006652
H  -3.470106 0.988061 1.859458
totalener: -1526.61411671 hartree
nucrepener: 3805.28552210 hartree
electener: -5331.89963880 hartree
oneelecener: -9696.26085544 hartree
twoeener: 4364.36121663 hartree
kineticenergy: 1436.19315297 hartree
chargesum: 1.0000000
charge: 0.253642 -0.285544 0.173352 0.163507 0.059940 0.765596 -0.085512 0.130407 0.120711 0.382938 -0.131965 0.123950 0.120494 -0.354267 -0.517572 -0.457111 -0.512712 -0.476110 0.256268 -0.197857 0.091485 0.109218 0.094892 0.014800 -0.210882 0.052574 0.080032 0.072976 -0.231719 0.076168 0.077018 0.068716 -0.336446 0.163395 0.161660 -0.177434 0.110887 0.076730 0.079683 -0.204184 0.088558 0.086516 0.118844 -0.146055 0.090420 -0.027518 -0.168485 0.065398 0.073314 0.079064 -0.210153 0.103446 0.050902 0.074614 0.301594 0.519933 -0.191430 0.089665 0.079744 0.037600 0.267781 0.067858 -0.201655 0.095613 0.006941 0.092854 -0.524341 0.278769 0.098486
charge: -0.218369 -0.154701 -0.178952 -0.030180 -0.179200 -0.214902 0.024167 0.042338 0.033138 -0.038146 0.022603 0.038569 0.033723 0.400763 0.120343 0.143215 0.088159 0.316267 -0.119358 0.008715 0.022674 0.036366 -0.083185 0.017573 0.027418 0.003584 0.014421 0.016164 0.033135 0.013775 0.012361 0.013597 -0.007600 0.034393 -0.078453 0.046608 0.031809 0.021592 0.023988 0.048646 0.025105 0.021162 0.032496 -0.029850 0.019311 -0.082771 0.036021 0.015125 0.016764 0.019199 0.026059 0.024574 0.001964 0.016463 -0.156491 0.373716 0.030168 0.020090 0.016439 0.013849 -0.138087 0.020675 0.032292 0.018785 0.010552 0.024146 0.278082 -0.137738 0.064840
qa: 0.2536 -0.2855 0.1734 0.1635 0.0599 0.7656 -0.0855 0.1304 0.1207 0.3829 -0.1320 0.1240 0.1205 -0.3543 -0.5176 -0.4571 -0.5127 -0.4761 0.2563 -0.1979 0.0915 0.1092 0.0949 0.0148 -0.2109 0.0526 0.0800 0.0730 -0.2317 0.0762 0.0770 0.0687 -0.3364 0.1634 0.1617 -0.1774 0.1109 0.0767 0.0797 -0.2042 0.0886 0.0865 0.1188 -0.1461 0.0904 -0.0275 -0.1685 0.0654 0.0733 0.0791 -0.2102 0.1034 0.0509 0.0746 0.3016 0.5199 -0.1914 0.0897 0.0797 0.0376 0.2678 0.0679 -0.2017 0.0956 0.0069 0.0929 -0.5243 0.2788 0.0985
va: 3.9581 3.2230 3.9662 3.8044 4.0919 3.2350 3.9352 1.0154 1.0066 3.7979 3.8188 1.0161 1.0231 2.1958 1.9550 1.9216 1.9213 1.9504 1.0136 3.9540 1.0014 1.0181 3.8029 1.0298 3.9587 1.0092 1.0054 1.0122 3.9714 1.0071 1.0045 1.0067 3.8153 1.0155 3.5771 3.9561 0.9997 1.0063 1.0049 3.9439 1.0069 1.0003 0.9998 3.7657 1.0287 3.7129 3.9684 1.0026 1.0072 1.0018 3.9553 1.0046 1.0001 0.9993 1.0372 0.9690 3.9662 1.0137 1.0179 1.0136 3.7400 1.0043 3.9410 1.0114 1.0095 1.0159 1.8973 1.0152 1.0238
e0: -1526.614116651 hartree
corrType: DLPNO BASED
energy: -1533.104005822331
dipole: -139.51058 140.47489 0.96431 -112.35353 113.66804 1.31451 33.84948 -33.62127 0.22820
magnitude: 1.64618 au
magnitude: 4.18426 debye
