program: Orca
programVersion: 5.0.2
elementType: C C C C C C C H H C C H H O O O O O H C H H C H C H H H C H H H C H C C H H H C H H H C H C C H H H C H H H H Ag H
elementType: Ag
charge: 1
multiplicity: 1
keywords: DLPNO-CCSD(T) def2-TZVPP def2-TZVPP/C VeryTightSCF
formula: C21H30O5Ag
InChI: InChI=1S/C21H30O5.Ag/c1-12(2)7-8-15-18(23)17(16(22)11-14(5)6)20(25)21(26,19(15)24)10-9-13(3)4;/h7,9,14,22,24,26H,8,10-11H2,1-6H3;
57 atoms
C  -2.113433 -1.05805 -0.719922
C  -2.914035 0.147882 -0.623136
C  -2.334046 1.316618 0.01815
C  -0.936755 1.283009 0.512558
C  -0.315089 0.10245 0.552366
C  -1.012497 -1.207832 0.331267
C  -0.306294 2.589147 0.919384
H  -1.1222 3.296101 1.08956
H  0.212217 2.471535 1.871439
C  -4.195944 0.240022 -1.175608
C  -4.933196 -0.881998 -1.819153
H  -5.790846 -0.449576 -2.335837
H  -4.287037 -1.369569 -2.545986
O  -4.86823 1.344665 -1.096245
O  -2.951462 2.387784 0.094596
O  1.010321 -0.020714 0.845087
O  -2.237245 -1.973839 -1.507862
O  -0.055171 -2.139595 -0.097714
H  -0.457907 -2.616979 -0.83904
C  -1.685758 -1.694858 1.644899
H  -2.479438 -0.998352 1.911147
H  -2.160894 -2.647646 1.398149
C  -5.424045 -1.929454 -0.795557
H  -4.544931 -2.347762 -0.297779
C  -6.33161 -1.308547 0.261354
H  -5.82322 -0.53478 0.840241
H  -6.676043 -2.069277 0.962232
H  -7.212451 -0.853517 -0.196468
C  -6.124302 -3.061811 -1.537896
H  -6.453865 -3.832825 -0.841012
H  -5.461169 -3.528115 -2.267397
H  -7.006314 -2.694828 -2.067427
C  0.597182 3.183592 -0.138767
H  0.234337 3.085613 -1.160518
C  1.652354 4.030573 0.06013
C  2.247651 4.792201 -1.094425
H  1.932022 5.835739 -1.021085
H  3.337328 4.794944 -1.061774
H  1.919466 4.40969 -2.05956
C  2.100999 4.482932 1.422762
H  3.182931 4.607092 1.46365
H  1.789053 3.823747 2.22986
H  1.666016 5.466722 1.61742
C  -0.70897 -1.886093 2.764192
H  -0.076626 -2.764254 2.679405
C  -0.553494 -1.104648 3.832711
C  0.462488 -1.442473 4.885521
H  1.173194 -0.622547 5.016874
H  1.018198 -2.345982 4.640407
H  -0.023047 -1.591982 5.852515
C  -1.347284 0.138894 4.112201
H  -1.873153 0.04464 5.06461
H  -2.080257 0.376318 3.344544
H  -0.677748 0.996986 4.214948
H  -4.299596 2.017117 -0.618334
Ag 2.332987 1.664719 -0.137674
H  1.221704 -0.964339 0.742861
totalener: -1333.38297102 hartree
nucrepener: 2945.75888695 hartree
electener: -4279.14185796 hartree
oneelecener: -7721.03968835 hartree
twoeener: 3441.89783038 hartree
kineticenergy: 1243.17806216 hartree
chargesum: 1.0000000
charge: 0.244368 -0.302110 0.387026 -0.195828 0.296401 0.693226 -0.144162 0.148129 0.107262 0.397724 -0.143063 0.120280 0.119346 -0.364640 -0.547438 -0.519560 -0.504696 -0.514461 0.265172 -0.155909 0.100896 0.105719 0.101165 0.008484 -0.212306 0.052989 0.077259 0.072168 -0.231062 0.073585 0.076375 0.067905 -0.212308 0.163474 0.022583 -0.162864 0.111517 0.081843 0.083949 -0.174436 0.092861 0.080489 0.117998 -0.237300 0.094342 0.020363 -0.176655 0.056844 0.074118 0.083063 -0.196700 0.103927 0.059522 0.053987 0.296953 0.590330 0.291857
charge: -0.213844 -0.146939 -0.185662 -0.082808 -0.098067 -0.212288 0.007911 0.046572 0.030187 -0.052248 0.022669 0.037589 0.034055 0.390439 0.096861 0.363204 0.083485 0.278585 -0.110130 0.008440 0.026775 0.035733 -0.084847 0.017208 0.026581 0.003853 0.013067 0.015656 0.031886 0.012632 0.012086 0.012973 -0.011578 0.038355 -0.070362 0.046096 0.032874 0.020830 0.023300 0.047946 0.024373 0.017868 0.035686 -0.036585 0.014280 -0.080735 0.032711 0.011698 0.015982 0.020333 0.030266 0.023244 0.006709 0.012936 -0.151470 0.558495 -0.084866
qa: 0.2444 -0.3021 0.3870 -0.1958 0.2964 0.6932 -0.1442 0.1481 0.1073 0.3977 -0.1431 0.1203 0.1193 -0.3646 -0.5474 -0.5196 -0.5047 -0.5145 0.2652 -0.1559 0.1009 0.1057 0.1012 0.0085 -0.2123 0.0530 0.0773 0.0722 -0.2311 0.0736 0.0764 0.0679 -0.2123 0.1635 0.0226 -0.1629 0.1115 0.0818 0.0839 -0.1744 0.0929 0.0805 0.1180 -0.2373 0.0943 0.0204 -0.1767 0.0568 0.0741 0.0831 -0.1967 0.1039 0.0595 0.0540 0.2970 0.5903 0.2919
va: 4.0089 3.3006 3.9206 3.6839 3.5380 3.4381 3.7898 1.0118 1.0067 3.7783 3.8297 1.0171 1.0225 2.1770 1.9222 1.8907 1.9411 1.9094 1.0130 3.8513 1.0018 1.0270 3.8111 1.0302 3.9582 1.0096 1.0052 1.0122 3.9711 1.0071 1.0045 1.0070 3.7370 1.0201 3.6325 3.9482 1.0006 1.0034 1.0038 3.9467 1.0048 0.9999 1.0002 3.7967 1.0264 3.6829 3.9696 1.0007 1.0056 1.0029 3.9693 1.0051 1.0021 1.0025 1.0355 0.7781 0.9842
e0: -1333.382971020 hartree
corrType: DLPNO BASED
energy: -1339.007706472506
dipole: -230.12653 233.49476 3.36823 -80.22450 81.82719 1.60269 46.66657 -46.50189 0.16468
magnitude: 3.73373 au
magnitude: 9.49038 debye
