program: Orca
programVersion: 5.0.2
elementType: C C C C C C C H H C C H H O O O O O H C H H C H C H H H C H H H C H C C H H H C H H H C H C C H H H C H H H H Ag C C H H H O C C H H H O H C H H H H C C H H H O H C H H H H C H H H H H H
elementType: Ag
charge: 1
multiplicity: 1
keywords: wB97X-D3 TightOpt Freq def2-TZVPP def2/J RIJCOSX TightSCF defgrid3 CHELPG
frequency: 0.00 0.00 0.00 0.00 0.00 0.00 16.55 19.19 22.68 27.48 31.59 32.49 37.06 37.23 41.47 45.17 46.85 49.71 52.33 55.23 61.94 64.65 70.19 71.84 76.30 80.06 86.93 95.37 100.99 105.30 114.28 116.69 118.21 122.72 132.74 139.38 147.24 155.57 162.35 168.41 175.29 188.78 200.67 206.75 217.68 225.16 229.73 231.75 234.48 236.29 239.62 243.14 251.37 262.05 270.38 274.05 280.11 283.31 286.27 301.96 312.22 321.95 326.32 354.34 360.95 370.08 374.00 378.91 380.77 389.74 397.71 409.04 418.25 429.99 431.04 437.85 445.42 451.93 472.94 479.85 481.90 494.61 495.39 496.98 498.43 505.66 516.56 530.06 544.75 546.85 569.10 620.02 654.50 684.14 738.22 753.88 764.08 771.41 809.72 821.87 837.41 841.23 846.60 851.05 863.42 872.16 885.53 898.37 919.10 930.87 935.05 941.39 942.67 942.76 943.46 953.25 957.73 957.81 962.38 971.32 972.84 976.23 980.43 984.33 984.40 990.44 1009.12 1024.87 1028.28 1037.87 1052.33 1069.48 1072.48 1085.51 1103.26 1105.70 1109.82 1124.84 1128.53 1130.74 1140.52 1155.45 1155.84 1166.38 1167.66 1168.64 1176.67 1191.26 1200.86 1203.38 1203.75 1205.02 1211.43 1222.05 1248.71 1253.57 1264.33 1282.26 1293.19 1306.44 1320.25 1326.96 1328.72 1342.27 1351.81 1361.20 1373.17 1376.37 1381.03 1381.94 1385.43 1386.49 1400.28 1400.61 1404.27 1410.66 1415.90 1416.57 1420.74 1424.95 1425.83 1426.55 1428.12 1429.94 1431.40 1432.68 1434.66 1435.44 1437.32 1443.98 1462.72 1467.08 1469.32 1474.94 1475.08 1476.30 1483.62 1486.84 1487.59 1488.44 1488.65 1490.04 1492.61 1494.41 1495.05 1496.53 1497.44 1498.36 1504.12 1505.69 1505.90 1506.31 1506.88 1510.51 1510.62 1513.46 1515.29 1516.16 1525.45 1616.10 1667.53 1707.08 1712.16 1769.65 1806.34 3026.27 3034.06 3036.44 3048.48 3052.83 3053.75 3053.88 3054.50 3054.91 3056.46 3056.70 3059.33 3060.73 3063.25 3063.41 3064.82 3067.23 3075.89 3076.64 3092.97 3096.99 3115.67 3117.59 3121.11 3122.35 3123.07 3125.71 3130.11 3131.65 3131.73 3132.44 3137.44 3139.75 3142.07 3142.31 3142.43 3142.62 3144.60 3148.30 3149.11 3151.84 3152.09 3153.71 3154.71 3155.78 3156.37 3156.66 3166.55 3172.90 3177.59 3465.38 3697.47 3738.81 3890.35
frequency: 16.55 19.19 22.68 27.48 31.59 32.49 37.06 37.23 41.47 45.17 46.85 49.71 52.33 55.23 61.94 64.65 70.19 71.84 76.30 80.06 86.93 95.37 100.99 105.30 114.28 116.69 118.21 122.72 132.74 139.38 147.24 155.57 162.35 168.41 175.29 188.78 200.67 206.75 217.68 225.16 229.73 231.75 234.48 236.29 239.62 243.14 251.37 262.05 270.38 274.05 280.11 283.31 286.27 301.96 312.22 321.95 326.32 354.34 360.95 370.08 374.00 378.91 380.77 389.74 397.71 409.04 418.25 429.99 431.04 437.85 445.42 451.93 472.94 479.85 481.90 494.61 495.39 496.98 498.43 505.66 516.56 530.06 544.75 546.85 569.10 620.02 654.50 684.14 738.22 753.88 764.08 771.41 809.72 821.87 837.41 841.23 846.60 851.05 863.42 872.16 885.53 898.37 919.10 930.87 935.05 941.39 942.67 942.76 943.46 953.25 957.73 957.81 962.38 971.32 972.84 976.23 980.43 984.33 984.40 990.44 1009.12 1024.87 1028.28 1037.87 1052.33 1069.48 1072.48 1085.51 1103.26 1105.70 1109.82 1124.84 1128.53 1130.74 1140.52 1155.45 1155.84 1166.38 1167.66 1168.64 1176.67 1191.26 1200.86 1203.38 1203.75 1205.02 1211.43 1222.05 1248.71 1253.57 1264.33 1282.26 1293.19 1306.44 1320.25 1326.96 1328.72 1342.27 1351.81 1361.20 1373.17 1376.37 1381.03 1381.94 1385.43 1386.49 1400.28 1400.61 1404.27 1410.66 1415.90 1416.57 1420.74 1424.95 1425.83 1426.55 1428.12 1429.94 1431.40 1432.68 1434.66 1435.44 1437.32 1443.98 1462.72 1467.08 1469.32 1474.94 1475.08 1476.30 1483.62 1486.84 1487.59 1488.44 1488.65 1490.04 1492.61 1494.41 1495.05 1496.53 1497.44 1498.36 1504.12 1505.69 1505.90 1506.31 1506.88 1510.51 1510.62 1513.46 1515.29 1516.16 1525.45 1616.10 1667.53 1707.08 1712.16 1769.65 1806.34 3026.27 3034.06 3036.44 3048.48 3052.83 3053.75 3053.88 3054.50 3054.91 3056.46 3056.70 3059.33 3060.73 3063.25 3063.41 3064.82 3067.23 3075.89 3076.64 3092.97 3096.99 3115.67 3117.59 3121.11 3122.35 3123.07 3125.71 3130.11 3131.65 3131.73 3132.44 3137.44 3139.75 3142.07 3142.31 3142.43 3142.62 3144.60 3148.30 3149.11 3151.84 3152.09 3153.71 3154.71 3155.78 3156.37 3156.66 3166.55 3172.90 3177.59 3465.38 3697.47 3738.81 3890.35
formula: C30H54O8Ag
InChI: InChI=1S/C21H30O5.3C3H8O.Ag/c1-12(2)7-8-15-18(23)17(16(22)11-14(5)6)20(25)21(26,19(15)24)10-9-13(3)4;3*1-3(2)4;/h7,9,14-15,22,26H,8,10-11H2,1-6H3;3*3-4H,1-2H3;
93 atoms
C  2.285332 -0.803544 -1.158804
C  1.958082 -1.83587 -0.189609
C  0.651997 -2.457803 -0.248319
C  -0.189048 -2.29413 -1.50181
C  0.023648 -1.008888 -2.261674
C  1.097078 -0.05392 -1.785405
C  -1.661353 -2.672095 -1.338983
H  -2.091809 -2.774718 -2.332546
H  -1.696717 -3.65743 -0.870499
C  2.859855 -2.254023 0.795586
C  4.244651 -1.739364 0.972212
H  4.776387 -2.453966 1.601833
H  4.735835 -1.678117 0.003811
O  2.502802 -3.132871 1.678884
O  0.242632 -3.221192 0.628926
O  -0.680647 -0.730065 -3.207631
O  3.39263 -0.402929 -1.454341
O  1.54074 0.74113 -2.834144
H  2.508777 0.697544 -2.792401
C  0.487091 0.834017 -0.661236
H  0.134056 0.215044 0.164796
H  1.322105 1.423115 -0.268404
C  4.275539 -0.346348 1.64024
H  3.712596 0.341081 1.003058
C  3.636465 -0.364586 3.024973
H  4.155003 -1.061255 3.686901
H  2.58638 -0.661304 2.993188
H  3.685866 0.625224 3.479639
C  5.717678 0.14392 1.69737
H  6.332898 -0.523885 2.304504
H  5.769429 1.137786 2.142719
H  6.157246 0.19755 0.700778
C  -2.474245 -1.729948 -0.48705
H  -1.994949 -1.384944 0.427076
C  -3.819325 -1.540422 -0.585353
C  -4.677721 -2.198363 -1.631164
H  -5.112774 -3.108623 -1.209967
H  -5.507102 -1.551592 -1.915872
H  -4.132885 -2.473504 -2.530803
C  -4.581158 -0.875953 0.53253
H  -3.921364 -0.39456 1.253375
H  -5.162434 -1.634035 1.063381
H  -5.296247 -0.143022 0.156458
C  -0.577534 1.771237 -1.157822
H  -0.455792 2.118015 -2.179715
C  -1.521713 2.365939 -0.40213
C  -1.701742 2.11717 1.069484
H  -2.758863 2.109518 1.338557
H  -1.242293 2.932827 1.633419
H  -1.250331 1.187647 1.411329
C  -2.353597 3.485368 -0.96759
H  -2.080779 4.422807 -0.477174
H  -3.418434 3.334555 -0.778067
H  -2.196606 3.602171 -2.038703
H  1.547126 -3.374655 1.509492
Ag -2.671279 0.32213 -1.65068
C  3.138647 -2.931235 -4.167269
C  3.636034 -3.722126 -2.976162
H  3.878047 -3.051416 -2.150235
H  2.882073 -4.435775 -2.642531
H  4.535824 -4.277665 -3.238476
O  1.892808 -2.333407 -3.779499
C  -0.372971 2.413279 -5.542436
C  0.571125 1.498709 -6.30059
H  1.262285 1.017016 -5.603565
H  0.016147 0.728906 -6.836904
H  1.160595 2.063216 -7.022731
O  -1.187233 1.643485 -4.650808
H  -0.677544 0.914888 -4.272089
C  4.124864 -1.868934 -4.617611
H  5.057572 -2.326593 -4.948375
H  3.726622 -1.292534 -5.455737
H  4.346857 -1.185479 -3.796849
H  2.941059 -3.620642 -4.995661
C  -4.623625 2.225554 -3.632209
C  -5.70687 1.813259 -2.66016
H  -6.075567 0.815451 -2.904171
H  -5.327574 1.806423 -1.634753
H  -6.545595 2.507092 -2.69897
O  -3.541164 1.29828 -3.481392
H  -2.789649 1.53056 -4.065553
C  0.354553 3.50457 -4.777031
H  0.920514 4.143119 -5.456156
H  -0.355626 4.131953 -4.236924
H  1.04847 3.064734 -4.058289
H  -1.075472 2.869683 -6.243588
C  -5.09279 2.231658 -5.074252
H  -5.460843 1.245365 -5.35929
H  -5.895268 2.956576 -5.212024
H  -4.277605 2.501912 -5.746777
H  -4.261175 3.224603 -3.36416
H  0.266212 -3.02141 -2.190547
H  1.576715 -1.788463 -4.501775
totalener: -1924.60463080 hartree
nucrepener: 5710.74754597 hartree
electener: -7635.35217677 hartree
twoeener: 6391.22545156 hartree
kineticenergy: 1825.83439750 hartree
xcener: -182.254940758747 hartree
chargesum: 1.0000000
charge: 0.102732 -0.230282 0.071198 0.133478 0.033840 0.720313 -0.136957 0.124978 0.125176 0.293273 -0.145676 0.115670 0.126605 -0.233327 -0.391167 -0.384977 -0.392276 -0.393101 0.224328 -0.285943 0.111568 0.129288 0.003981 0.047177 -0.246967 0.094603 0.076574 0.094958 -0.265888 0.090441 0.091254 0.096326 -0.249950 0.155140 0.124071 -0.225072 0.131511 0.095662 0.099710 -0.229976 0.088487 0.130278 0.097740 -0.147304 0.090432 0.090042 -0.278250 0.101341 0.137563 0.096013 -0.222688 0.132817 0.088611 0.076948 0.237433 0.208850 0.147147 -0.256171 0.054519 0.090998 0.110095 -0.352723 0.140337 -0.249131 0.048927 0.105509 0.095973 -0.407681 0.236611 -0.271720 0.097375 0.078288 0.090152 0.083209 0.130933 -0.256646 0.099340 0.047872 0.120132 -0.400777 0.267535 -0.238635 0.107287 0.082021 0.076532 0.059420 -0.225686 0.091298 0.095053 0.084339 0.071389 0.131448 0.184821
charge: -0.263043 -0.136283 -0.225517 -0.051787 -0.215583 -0.260364 0.008635 0.038513 0.045304 -0.111924 0.007234 0.043125 0.033903 0.444223 0.177217 0.198627 0.158616 0.326511 -0.133910 0.008080 0.032246 0.049057 -0.098457 0.022123 0.013786 0.021702 0.008315 0.018061 0.019736 0.019105 0.017925 0.017620 -0.019747 0.033714 -0.090683 0.037564 0.035841 0.027787 0.025435 0.032615 0.025566 0.035645 0.026078 -0.005709 0.032741 -0.085895 0.028940 0.027174 0.035831 0.017902 0.030191 0.033094 0.024617 0.025528 -0.159704 0.219218 -0.192022 0.008419 0.013476 0.014006 0.023163 0.291474 -0.191419 0.004443 0.007921 0.015806 0.021991 0.327741 -0.160593 0.002300 0.022392 0.010106 0.014119 0.015742 -0.188855 0.013196 0.020750 0.010215 0.027304 0.333532 -0.177728 -0.000504 0.020512 0.009991 0.011092 0.019475 0.015024 0.020350 0.022818 0.015233 0.016058 0.073198 -0.137267
qa: 0.1027 -0.2303 0.0712 0.1335 0.0338 0.7203 -0.1370 0.1250 0.1252 0.2933 -0.1457 0.1157 0.1266 -0.2333 -0.3912 -0.3850 -0.3923 -0.3931 0.2243 -0.2859 0.1116 0.1293 0.0040 0.0472 -0.2470 0.0946 0.0766 0.0950 -0.2659 0.0904 0.0913 0.0963 -0.2500 0.1551 0.1241 -0.2251 0.1315 0.0957 0.0997 -0.2300 0.0885 0.1303 0.0977 -0.1473 0.0904 0.0900 -0.2783 0.1013 0.1376 0.0960 -0.2227 0.1328 0.0886 0.0769 0.2374 0.2088 0.1471 -0.2562 0.0545 0.0910 0.1101 -0.3527 0.1403 -0.2491 0.0489 0.1055 0.0960 -0.4077 0.2366 -0.2717 0.0974 0.0783 0.0902 0.0832 0.1309 -0.2566 0.0993 0.0479 0.1201 -0.4008 0.2675 -0.2386 0.1073 0.0820 0.0765 0.0594 -0.2257 0.0913 0.0951 0.0843 0.0714 0.1314 0.1848
va: 3.8861 3.3272 4.0788 3.7329 3.8726 3.3906 3.9188 1.0164 1.0181 3.8340 3.8130 1.0250 1.0185 2.3320 2.1116 2.0223 2.0561 2.0939 1.0547 3.9695 0.9998 1.0158 3.8595 1.0214 3.9202 1.0090 1.0104 1.0060 3.9483 1.0042 1.0070 1.0053 3.8002 1.0259 3.6755 3.9418 0.9967 1.0063 1.0084 3.9530 1.0046 0.9989 1.0024 3.5946 1.1021 3.5889 3.9606 0.9997 0.9988 0.9982 3.9379 1.0024 1.0029 1.0164 1.0975 1.6319 3.8496 3.9269 1.0095 1.0104 1.0149 2.0472 3.9164 3.9192 1.0210 1.0079 1.0136 2.0039 1.0412 3.9509 1.0175 1.0051 1.0051 0.9941 3.8330 3.8967 1.0027 1.0090 1.0148 2.0349 1.0389 3.8463 1.0134 1.0134 1.0192 0.9972 3.9681 1.0063 1.0108 1.0106 0.9903 1.0478 1.0395
dispcorr: -0.068331589 hartree
energy: -1924.672961564399
dipole: 161.29087 -162.60580 -1.31494 -16.87888 17.57232 0.69344 -9.70915 9.94531 0.23616
magnitude: 1.50522 au
magnitude: 3.82597 debye
temp: 298.15 k
press: 1.00 atm
zeropoint: 0.81323421 hartree
thermalvibcorrection: 0.04838708 hartree
thermalrotcorrection: 0.00141627 hartree
thermaltrasncorrection: 0.00141627 hartree
thermaltotal: -1923.80850773 hartree
thermalcorr: 0.05121963 hartree
nonthermalcorr: 0.81323421 hartree
totalcorr: 0.86445384 hartree
thermalcorrenthalpy: 0.00094421 hartree
totalenthalpy: -1923.80756352 hartree
totalentropycorr: -0.12862613 hartree
gibbsenthalpy: -1923.93618965 hartree
gibbsminuselec: 0.73677191 hartree
