program: Gaussian 09
title: 000005733
version: EM64L-G09RevD.01
frameworkgroup: C1[X(C15H14ClNO3)]
method: RPBEPBE
basis: SDD
operation: Freq
keyword: #p
keyword: freq=noraman
keyword: PBEPBE/SDD
title: #p freq=noraman PBEPBE/SDD
converged: YES YES NO NO
title: Mulliken charges:
elementType: Cl O O O N C C C C C C C C C C C C C C C H H H H H H H H H H H H H H
charge: -0.050322 -0.260892 -0.411162 -0.223756 -0.211399 0.122554 0.427712 0.263838 -0.545678 -0.660805 -0.014326 -0.658923 -0.811129 0.331066 0.211135 -0.357376 -0.354922 -0.221486 -0.214687 -0.112377 0.262507 0.265583 0.285198 0.214994 0.301144 0.263865 0.243396 0.231926 0.232957 0.276424 0.276335 0.258825 0.258086 0.381694
chargesum: 0.00000
title: Mulliken charges with hydrogens summed into heavy atoms:
elementType: Cl O O O N C C C C C C C C C C C C C C C
charge: -0.050322 -0.260892 -0.029468 -0.223756 -0.211399 0.122554 0.427712 0.263838 -0.283172 -0.110023 -0.014326 0.121080 -0.102850 0.331066 0.211135 -0.080953 -0.078587 0.037339 0.043399 -0.112377
polarizability: 3.07107843e+02 3.23715470e-01 1.65409374e+02 -1.10404410e+01 -3.99737984e-02 1.25169934e+02
1716.lowfreq: -8.3226 -3.5165 0.0004 0.0014 0.0021 5.0194 22.7714 25.9723 42.1676
frequency: 22.7229 25.9418 42.1408 53.2265 67.5370 78.0851 94.0250 100.0601 124.1776 140.6404 175.6689 199.6621 213.4588 235.9213 262.7191 267.6186 295.6701 311.4677 337.4425 367.6617 402.3354 412.2885 420.3968 471.0420 482.9147 520.1774 562.7486 571.3945 582.4555 621.4092 630.7697 645.3626 649.8191 698.0714 720.9177 724.0462 760.3448 801.6890 823.1063 835.5080 850.0616 859.4167 925.3678 934.6301 964.7532 976.6971 985.7317 1002.5007 1040.3039 1041.9431 1058.3524 1069.8050 1106.8798 1124.0846 1141.3340 1156.7074 1166.9168 1181.9285 1214.4321 1247.4616 1270.4003 1291.8813 1332.2734 1355.4563 1366.3720 1389.9817 1394.8489 1405.7282 1428.0903 1431.7868 1461.6257 1467.8696 1472.7838 1475.0010 1481.6657 1491.7093 1497.4939 1514.9259 1556.8225 1579.9662 1592.6134 1671.8707 2982.2798 2985.8193 2998.6955 3059.3844 3071.5989 3086.1394 3095.8271 3132.1402 3146.8571 3154.6129 3171.0744 3176.0910 3205.6398 3513.6081
redmass: 7.8726 6.5329 5.0735 4.7308 3.1071 7.2073 1.1764 2.6532 1.7310 2.9651 6.0302 6.1353 4.3662 4.6901 4.3641 3.4275 4.7694 4.9663 3.7325 6.0214 4.8192 3.1215 5.1109 3.8149 2.1602 3.6253 4.3015 4.8426 4.7701 6.5748 2.5759 1.7359 4.3427 5.3599 5.7106 5.0617 4.1325 1.7627 2.2976 1.2766 2.1036 3.2833 2.4155 3.7309 1.3551 1.3798 1.5631 3.8844 1.5279 2.5715 2.5748 2.8404 1.3459 1.3222 2.0821 1.3826 2.1450 1.1858 1.5616 1.5845 4.6860 1.2583 2.0789 4.3719 5.1236 3.2476 2.9693 1.2081 2.0556 1.1943 1.9366 2.2666 1.6164 1.3011 1.2888 1.8709 1.2031 4.6880 5.9707 7.6899 6.2627 8.3538 1.0394 1.0670 1.0349 1.0955 1.0916 1.1017 1.0984 1.1002 1.0890 1.0886 1.0962 1.0973 1.0983 1.0641
irintensity: 0.3946 0.2743 0.1441 0.4826 0.2720 2.8106 0.6849 4.9570 0.6482 1.3462 1.3136 0.2289 4.4152 7.5823 0.9971 1.2009 1.8431 10.3702 1.6832 4.9838 3.6719 1.9933 17.0620 11.4388 21.6318 21.3478 50.6756 2.9696 2.1935 1.3252 42.2318 99.5590 11.2801 6.5366 9.1813 5.4534 39.2890 7.2128 47.4052 0.5661 22.2990 12.5351 20.3086 155.2927 1.7809 6.3146 4.2804 23.2455 15.4491 365.5981 11.5403 55.2917 11.2412 6.0991 8.3701 3.6073 31.5760 4.4260 21.0505 23.3329 89.0394 1.4998 44.5768 45.6490 3.5719 61.3785 106.0152 6.0825 140.1958 50.2350 22.4234 65.7109 29.7279 71.4771 3.7664 25.6661 52.2500 152.2424 28.8087 23.6757 109.2614 173.6748 31.8926 14.7228 56.0887 23.6908 1.6222 16.3315 16.0425 2.6292 2.9597 0.1701 3.8991 3.1773 4.7430 29.8059
temp: 298.150 k
press: 1.00000 atm
elementType: 17 8 8 8 7 6 6 6 6 6 6 6 6 6 6 6 6 6 6 6 1 1 1 1 1 1 1 1 1 1 1 1 1 1
symmnumber: 1
zpe: 672976.5 jmol-1
zpe.correction: 0.256323 hartree
zpe.thermalcorrener: 0.275819 hartree
zpe.thermalcorrenthalpy: 0.276763 hartree
zpe.thermalcorrgfe: 0.205865 hartree
zpe.sumelectzpe: -1319.055244 hartree
zpe.sumelectthermal: -1319.035749 hartree
zpe.sumelectthermalent: -1319.034805 hartree
zpe.sumelectthermalfe: -1319.105702 hartree
dipole: -3.9176 -1.7479 0.7697
dipole: 4.3584
quadrupole: -110.0527 -123.7440 -123.3055
quadrupole: 2.0807 5.8833 -1.1862
quadrupole: 8.9813 -4.7099 -4.2714 2.0807 5.8833 -1.1862
hfenergy: -1319.3115675 hartree
pointgroup: C01 [X(C15H14Cl1N1O3)]
dipole: 1.6392271 0.0411958 -0.5014564 debye
polarizability: 305.2009484|1.3970557|127.5213342|19.007976|10.9034121|164.9648681 unknown
InChI: InChI=1S/C15H14ClNO3/c1-9-7-12(8-13(18)19)17(2)14(9)15(20)10-3-5-11(16)6-4-10/h3-7,18H,8H2,1-2H3
charge 0 multiplicity 1
34 atoms
Cl -6.152652 -0.84556 -1.604725
O  -0.868944 0.935937 2.277929
O  5.898448 -1.470607 0.396335
O  3.721863 -2.272561 0.513886
N  1.688819 0.31285 0.919182
C  0.453434 0.604501 0.28738
C  2.713558 0.457094 -0.006129
C  0.738448 0.986463 -1.059237
C  2.152133 0.891767 -1.221828
C  4.155406 0.176139 0.299121
C  -0.815898 0.646434 1.029256
C  1.858765 -0.240501 2.277247
C  -0.206048 1.513275 -2.114881
C  -2.096421 0.315499 0.311258
C  4.505432 -1.307494 0.408732
C  -2.148234 -0.64295 -0.734089
C  -3.305071 0.89688 0.778077
C  -3.380727 -1.006575 -1.318058
C  -4.541941 0.55872 0.194529
C  -4.557637 -0.390797 -0.848664
H  2.712263 1.135029 -2.124243
H  4.485774 0.65288 1.244465
H  4.792044 0.611782 -0.489602
H  2.772062 0.176273 2.73598
H  0.995005 0.055093 2.887979
H  1.948913 -1.339646 2.234434
H  -1.088801 2.008819 -1.679022
H  0.315005 2.247068 -2.755092
H  -0.579947 0.709327 -2.776673
H  -1.225258 -1.123608 -1.074752
H  -3.25753 1.606272 1.610488
H  -3.42636 -1.75579 -2.113529
H  -5.47335 1.013969 0.54295
H  6.119146 -2.43748 0.487393
