program: Orca
programVersion: 5.0.2
elementType: C C C C C C C H H C C H H O O O O O H C H H C H C H H H C H H H C H C C H H H C H H H C H C C H H H C H H H H Ag C C H H H O C C H H H O H C H H H H C C H H H O H C H H H H C H H H H H H
elementType: Ag
charge: 1
multiplicity: 1
keywords: wB97X-D3 TightOpt Freq def2-TZVPP def2/J RIJCOSX TightSCF defgrid3 CHELPG
frequency: 0.00 0.00 0.00 0.00 0.00 0.00 18.33 23.69 24.06 30.26 33.97 38.05 38.56 42.68 44.45 47.36 49.53 50.34 54.82 58.26 65.43 67.34 69.01 80.69 86.74 91.05 93.14 97.08 98.54 100.72 112.91 114.40 122.06 128.10 138.50 144.69 156.89 161.77 170.05 180.43 181.19 195.87 201.69 207.16 220.18 223.19 226.23 229.32 230.82 233.54 234.22 246.86 260.12 266.45 269.63 272.13 283.52 284.36 296.26 304.86 326.29 344.10 355.55 364.67 370.60 375.45 378.00 379.61 387.71 389.37 399.44 413.89 418.60 426.16 437.41 449.64 456.10 469.33 473.33 482.67 485.95 488.79 490.95 496.30 503.89 519.08 522.21 549.76 558.53 571.50 621.48 643.10 655.07 696.64 748.57 766.58 777.82 801.86 811.47 821.20 826.32 834.95 839.59 847.62 864.35 880.15 885.90 888.03 906.58 921.62 935.19 937.85 939.46 941.28 943.93 946.41 951.30 953.96 956.27 966.59 967.85 972.45 975.61 982.09 983.59 988.51 990.40 1023.58 1026.56 1032.88 1042.51 1065.73 1068.78 1097.50 1101.91 1104.09 1105.40 1116.28 1124.37 1128.45 1145.32 1153.58 1154.33 1160.86 1164.31 1170.79 1175.90 1180.11 1190.06 1198.51 1201.92 1204.02 1213.92 1241.28 1254.84 1269.09 1287.67 1291.61 1305.31 1317.07 1326.19 1332.19 1332.83 1335.10 1355.01 1360.42 1374.29 1374.76 1379.57 1380.25 1386.79 1390.30 1399.36 1412.59 1414.98 1418.29 1418.77 1424.23 1424.85 1426.14 1426.86 1428.19 1429.28 1433.72 1435.22 1436.15 1436.34 1439.38 1443.58 1461.32 1464.79 1472.47 1474.84 1476.80 1478.23 1483.49 1485.75 1487.63 1488.19 1489.00 1489.64 1490.31 1492.64 1494.54 1495.32 1497.79 1498.09 1498.50 1505.29 1506.35 1507.16 1507.60 1509.18 1510.36 1511.15 1512.61 1513.68 1514.58 1531.15 1628.89 1670.80 1682.75 1703.51 1708.67 1775.96 2982.97 3028.11 3050.16 3052.85 3052.86 3053.18 3054.40 3055.30 3055.42 3055.72 3057.92 3059.71 3059.92 3061.91 3062.13 3066.59 3073.45 3094.68 3096.45 3098.69 3113.87 3120.02 3121.14 3123.56 3123.89 3125.06 3130.06 3130.08 3130.55 3135.47 3137.88 3137.92 3138.94 3140.54 3141.52 3144.72 3145.14 3147.46 3149.23 3150.53 3152.21 3153.26 3153.42 3154.27 3161.08 3162.94 3166.14 3169.67 3182.69 3255.21 3426.13 3670.20 3724.27 3872.75
frequency: 18.33 23.69 24.06 30.26 33.97 38.05 38.56 42.68 44.45 47.36 49.53 50.34 54.82 58.26 65.43 67.34 69.01 80.69 86.74 91.05 93.14 97.08 98.54 100.72 112.91 114.40 122.06 128.10 138.50 144.69 156.89 161.77 170.05 180.43 181.19 195.87 201.69 207.16 220.18 223.19 226.23 229.32 230.82 233.54 234.22 246.86 260.12 266.45 269.63 272.13 283.52 284.36 296.26 304.86 326.29 344.10 355.55 364.67 370.60 375.45 378.00 379.61 387.71 389.37 399.44 413.89 418.60 426.16 437.41 449.64 456.10 469.33 473.33 482.67 485.95 488.79 490.95 496.30 503.89 519.08 522.21 549.76 558.53 571.50 621.48 643.10 655.07 696.64 748.57 766.58 777.82 801.86 811.47 821.20 826.32 834.95 839.59 847.62 864.35 880.15 885.90 888.03 906.58 921.62 935.19 937.85 939.46 941.28 943.93 946.41 951.30 953.96 956.27 966.59 967.85 972.45 975.61 982.09 983.59 988.51 990.40 1023.58 1026.56 1032.88 1042.51 1065.73 1068.78 1097.50 1101.91 1104.09 1105.40 1116.28 1124.37 1128.45 1145.32 1153.58 1154.33 1160.86 1164.31 1170.79 1175.90 1180.11 1190.06 1198.51 1201.92 1204.02 1213.92 1241.28 1254.84 1269.09 1287.67 1291.61 1305.31 1317.07 1326.19 1332.19 1332.83 1335.10 1355.01 1360.42 1374.29 1374.76 1379.57 1380.25 1386.79 1390.30 1399.36 1412.59 1414.98 1418.29 1418.77 1424.23 1424.85 1426.14 1426.86 1428.19 1429.28 1433.72 1435.22 1436.15 1436.34 1439.38 1443.58 1461.32 1464.79 1472.47 1474.84 1476.80 1478.23 1483.49 1485.75 1487.63 1488.19 1489.00 1489.64 1490.31 1492.64 1494.54 1495.32 1497.79 1498.09 1498.50 1505.29 1506.35 1507.16 1507.60 1509.18 1510.36 1511.15 1512.61 1513.68 1514.58 1531.15 1628.89 1670.80 1682.75 1703.51 1708.67 1775.96 2982.97 3028.11 3050.16 3052.85 3052.86 3053.18 3054.40 3055.30 3055.42 3055.72 3057.92 3059.71 3059.92 3061.91 3062.13 3066.59 3073.45 3094.68 3096.45 3098.69 3113.87 3120.02 3121.14 3123.56 3123.89 3125.06 3130.06 3130.08 3130.55 3135.47 3137.88 3137.92 3138.94 3140.54 3141.52 3144.72 3145.14 3147.46 3149.23 3150.53 3152.21 3153.26 3153.42 3154.27 3161.08 3162.94 3166.14 3169.67 3182.69 3255.21 3426.13 3670.20 3724.27 3872.75
formula: C30H54O8Ag
InChI: InChI=1S/C21H30O5.3C3H8O.Ag/c1-12(2)7-8-15-18(23)17(16(22)11-14(5)6)20(25)21(26,19(15)24)10-9-13(3)4;3*1-3(2)4;/h7,9,14,22,24,26H,8,10-11H2,1-6H3;3*3-4H,1-2H3;
93 atoms
C  2.876657 -0.316481 -0.260328
C  2.540762 -1.231376 0.808668
C  1.302653 -1.999143 0.700685
C  0.508909 -1.952112 -0.534826
C  0.810934 -1.030722 -1.466741
C  1.70315 0.137568 -1.146158
C  -0.699166 -2.849167 -0.646336
H  -0.786748 -3.280314 -1.641264
H  -0.575689 -3.67846 0.051878
C  3.367444 -1.426705 1.916604
C  4.650124 -0.711889 2.168024
H  5.178746 -1.262624 2.947273
H  5.249257 -0.713868 1.260317
O  3.018665 -2.245273 2.860171
O  0.934612 -2.751134 1.616427
O  0.237673 -0.93167 -2.667155
O  3.958323 0.179531 -0.510872
O  2.207392 0.726691 -2.309283
H  3.154551 0.854229 -2.13643
C  0.916737 1.185063 -0.307655
H  0.685187 0.757061 0.666019
H  1.616468 2.009442 -0.13435
C  4.434652 0.746286 2.626834
H  3.873137 1.262692 1.843368
C  3.639238 0.821429 3.926186
H  4.156054 0.296618 4.732401
H  2.646429 0.377879 3.829118
H  3.5094 1.859352 4.234622
C  5.788922 1.433029 2.761043
H  6.402309 0.940912 3.519227
H  5.666462 2.474665 3.059641
H  6.336629 1.414389 1.818158
C  -1.962183 -2.111494 -0.252852
H  -1.918869 -1.645847 0.729665
C  -3.178149 -2.169304 -0.86016
C  -3.463252 -2.992754 -2.086354
H  -3.97014 -3.912542 -1.783472
H  -4.14171 -2.467175 -2.759554
H  -2.568412 -3.267813 -2.638364
C  -4.403697 -1.623183 -0.169714
H  -4.152854 -1.011909 0.696498
H  -5.018426 -2.457798 0.176235
H  -5.026419 -1.039528 -0.849624
C  -0.307766 1.753511 -0.961832
H  -0.18486 2.060062 -1.99654
C  -1.44668 2.117766 -0.334305
C  -1.7115 1.905015 1.13162
H  -2.759227 1.655111 1.304208
H  -1.517641 2.832444 1.676161
H  -1.096761 1.12496 1.574981
C  -2.465023 2.975363 -1.041538
H  -2.454703 3.977044 -0.604889
H  -3.48104 2.595724 -0.914909
H  -2.249826 3.069235 -2.104919
H  2.126773 -2.634743 2.607694
Ag -2.036565 -0.106625 -1.550712
C  -1.326715 -2.494457 -5.197102
C  -2.078622 -3.627459 -5.864853
H  -1.386168 -4.350525 -6.302697
H  -2.716019 -4.149269 -5.15159
H  -2.705872 -3.243821 -6.669744
O  -0.583637 -3.000613 -4.06196
C  0.78136 2.504184 -5.12312
C  2.065678 2.135302 -5.841951
H  2.839104 1.855147 -5.123098
H  1.901906 1.295019 -6.516052
H  2.438854 2.977081 -6.425247
O  0.257519 1.361942 -4.43593
H  0.925703 1.011758 -3.82903
C  -0.405585 -1.743261 -6.137756
H  -0.975336 -1.322543 -6.966833
H  0.096542 -0.924646 -5.622267
H  0.3472 -2.412985 -6.561253
H  -2.030289 -1.792493 -4.744793
C  -3.277798 1.287339 -4.416166
C  -4.586163 0.83406 -3.806507
H  -4.726339 -0.237102 -3.965971
H  -4.606007 1.034594 -2.732569
H  -5.427346 1.358268 -4.258169
O  -2.227935 0.581473 -3.745699
H  -1.350764 0.892017 -4.058637
C  0.955718 3.670973 -4.166153
H  1.309259 4.556259 -4.694998
H  0.009871 3.921734 -3.683448
H  1.685467 3.423845 -3.391967
H  0.015283 2.755295 -5.860697
C  -3.203658 1.027125 -5.909405
H  -3.376008 -0.029672 -6.121075
H  -3.956739 1.610261 -6.439539
H  -2.224231 1.301311 -6.303608
H  -3.146762 2.360032 -4.230761
H  0.07886 -3.620999 -4.373894
H  -0.063965 -1.78883 -3.060421
totalener: -1924.60673416 hartree
nucrepener: 5721.98494959 hartree
electener: -7646.59168375 hartree
twoeener: 6402.62081078 hartree
kineticenergy: 1825.85418951 hartree
xcener: -182.281765667983 hartree
chargesum: 1.0000000
charge: 0.149616 -0.267295 0.208238 -0.039601 0.145055 0.582567 -0.239586 0.127896 0.129660 0.290671 -0.144320 0.111833 0.122806 -0.247575 -0.425755 -0.381972 -0.385296 -0.399354 0.213904 -0.271277 0.128737 0.116337 -0.003174 0.044991 -0.245624 0.092786 0.077056 0.092064 -0.265233 0.089274 0.088764 0.096200 -0.135741 0.165531 0.077736 -0.258201 0.135873 0.094118 0.084748 -0.224792 0.090396 0.128221 0.092243 -0.098697 0.033820 0.062742 -0.263458 0.097971 0.136079 0.098749 -0.225613 0.134014 0.095944 0.072806 0.238483 0.285394 0.142778 -0.223016 0.090784 0.097891 0.090751 -0.359426 0.121938 -0.242394 0.081949 0.094133 0.096718 -0.408172 0.246342 -0.232844 0.089275 0.081959 0.097889 0.009736 0.140671 -0.270658 0.093020 0.063092 0.120515 -0.447203 0.272400 -0.226158 0.109948 0.073774 0.079725 0.054564 -0.251993 0.074661 0.114018 0.089918 0.079887 0.197712 0.245056
charge: -0.251689 -0.133287 -0.234702 -0.092696 -0.172056 -0.236713 0.001041 0.024919 0.045020 -0.117995 0.007301 0.041469 0.036024 0.431026 0.162827 0.409289 0.150262 0.324446 -0.133367 0.008432 0.035583 0.047411 -0.100070 0.022222 0.012873 0.020995 0.008811 0.016679 0.018070 0.018497 0.016641 0.017304 -0.005056 0.039720 -0.095107 0.030626 0.034660 0.024907 0.016774 0.031033 0.026252 0.034125 0.024879 0.001591 0.028394 -0.090082 0.029972 0.027097 0.034606 0.019179 0.029299 0.034099 0.024941 0.023469 -0.167675 0.211942 -0.186510 0.009931 0.018451 0.015483 0.023581 0.349528 -0.199421 0.008694 0.015293 0.015370 0.021926 0.332318 -0.155224 0.005509 0.022581 0.010931 0.016746 0.016987 -0.192910 0.015177 0.018640 0.013577 0.027622 0.329820 -0.181747 0.001382 0.022697 0.008354 0.013444 0.018901 0.012177 0.015611 0.024275 0.014641 0.015929 -0.124076 -0.169899
qa: 0.1496 -0.2673 0.2082 -0.0396 0.1451 0.5826 -0.2396 0.1279 0.1297 0.2907 -0.1443 0.1118 0.1228 -0.2476 -0.4258 -0.3820 -0.3853 -0.3994 0.2139 -0.2713 0.1287 0.1163 -0.0032 0.0450 -0.2456 0.0928 0.0771 0.0921 -0.2652 0.0893 0.0888 0.0962 -0.1357 0.1655 0.0777 -0.2582 0.1359 0.0941 0.0847 -0.2248 0.0904 0.1282 0.0922 -0.0987 0.0338 0.0627 -0.2635 0.0980 0.1361 0.0987 -0.2256 0.1340 0.0959 0.0728 0.2385 0.2854 0.1428 -0.2230 0.0908 0.0979 0.0908 -0.3594 0.1219 -0.2424 0.0819 0.0941 0.0967 -0.4082 0.2463 -0.2328 0.0893 0.0820 0.0979 0.0097 0.1407 -0.2707 0.0930 0.0631 0.1205 -0.4472 0.2724 -0.2262 0.1099 0.0738 0.0797 0.0546 -0.2520 0.0747 0.1140 0.0899 0.0799 0.1977 0.2451
va: 4.0492 3.4629 4.0563 3.5794 3.7145 3.6030 3.9449 1.0113 1.0277 3.8701 3.8199 1.0248 1.0249 2.3141 2.0893 2.0947 2.0956 2.0513 1.0655 3.9465 0.9840 1.0256 3.8751 1.0180 3.9192 1.0091 1.0112 1.0059 3.9452 1.0045 1.0071 1.0050 3.7146 1.0259 3.6556 3.9551 0.9998 1.0030 1.0184 3.9474 1.0077 0.9988 1.0024 3.5878 1.1401 3.6515 3.9610 1.0010 0.9964 1.0012 3.9340 1.0002 1.0053 1.0120 1.1022 1.4634 3.8422 3.9531 1.0091 1.0040 1.0099 2.0551 3.9173 3.9476 1.0086 1.0080 1.0122 2.0076 1.0341 3.9452 1.0096 1.0252 1.0143 1.0268 3.8090 3.9362 1.0001 1.0069 1.0156 1.9668 1.0474 3.8609 1.0150 1.0086 1.0226 0.9930 3.9518 1.0032 1.0148 1.0083 0.9863 1.0361 1.0880
dispcorr: -0.069677337 hartree
energy: -1924.676412208280
dipole: 115.03543 -117.08372 -2.04829 11.69693 -11.25160 0.44533 -21.90190 20.42513 -1.47676
magnitude: 2.56411 au
magnitude: 6.51745 debye
temp: 298.15 k
press: 1.00 atm
zeropoint: 0.81452580 hartree
thermalvibcorrection: 0.04784526 hartree
thermalrotcorrection: 0.00141627 hartree
thermaltrasncorrection: 0.00141627 hartree
thermaltotal: -1923.81120861 hartree
thermalcorr: 0.05067780 hartree
nonthermalcorr: 0.81452580 hartree
totalcorr: 0.86520360 hartree
thermalcorrenthalpy: 0.00094421 hartree
totalenthalpy: -1923.81026440 hartree
totalentropycorr: -0.12717374 hartree
gibbsenthalpy: -1923.93743814 hartree
gibbsminuselec: 0.73897406 hartree
