program: Orca
programVersion: 5.0.2
elementType: C C C C C C C H H C C H H O O O O O H C H H C H C H H H C H H H C H C C H H H C H H H C H C C H H H C H H H H Ag C H H H C H C H H H O H C O H C H H H C O H C H H H C H H H H C H H H H H
elementType: Ag
charge: 1
multiplicity: 1
keywords: wB97X-D3 TightOpt Freq def2-TZVPP def2/J RIJCOSX TightSCF defgrid3 CHELPG
frequency: 0.00 0.00 0.00 0.00 0.00 0.00 6.44 8.55 12.40 15.07 16.36 18.93 20.75 29.24 33.59 37.98 38.42 44.52 45.62 48.69 53.49 55.22 61.40 67.24 75.52 79.30 81.46 85.03 89.42 93.89 100.64 106.24 113.44 122.09 125.06 131.90 143.37 162.80 170.91 179.27 183.66 190.60 193.31 207.43 213.97 218.10 226.93 229.96 231.16 233.59 234.05 236.85 257.28 265.41 273.80 274.71 276.03 281.55 301.11 304.09 322.59 340.43 342.41 360.17 365.99 371.76 375.73 376.80 377.78 388.92 392.97 411.16 415.96 431.39 436.26 443.37 447.07 449.93 460.96 475.59 477.35 483.64 492.37 494.33 508.34 509.23 525.09 534.59 554.93 572.54 601.95 613.59 648.34 664.38 739.73 758.78 764.89 774.87 801.82 812.71 834.04 841.09 841.72 857.53 863.43 873.99 881.65 892.33 918.07 924.21 939.61 939.69 942.52 944.33 946.25 956.59 956.88 958.55 964.54 968.62 971.90 974.72 976.76 982.06 983.36 985.89 1016.10 1022.36 1023.50 1035.94 1057.62 1077.62 1085.23 1094.36 1100.98 1104.42 1110.34 1115.27 1121.58 1123.05 1136.18 1145.06 1154.79 1156.01 1157.68 1159.88 1168.06 1182.42 1197.18 1198.27 1199.80 1201.40 1204.79 1226.12 1248.66 1255.70 1260.77 1277.26 1279.57 1294.85 1309.65 1316.73 1322.00 1328.14 1334.20 1353.35 1370.95 1374.90 1379.97 1380.99 1384.48 1386.33 1397.38 1398.28 1403.30 1406.07 1408.24 1412.33 1420.32 1425.65 1425.91 1426.30 1427.28 1430.66 1431.56 1432.36 1435.40 1437.80 1439.01 1442.80 1448.65 1462.43 1474.23 1474.97 1478.00 1480.33 1484.48 1485.94 1486.82 1488.32 1488.94 1491.51 1492.69 1493.14 1494.41 1495.11 1496.77 1499.08 1502.27 1504.59 1504.91 1505.20 1505.94 1510.34 1511.53 1511.96 1512.24 1513.65 1518.26 1619.57 1659.17 1697.05 1752.31 1770.90 1813.59 2872.34 3010.74 3028.74 3046.24 3047.91 3048.52 3051.28 3051.67 3054.27 3055.84 3056.50 3056.53 3059.50 3060.37 3060.78 3061.04 3063.45 3064.06 3072.33 3094.61 3097.96 3107.70 3119.63 3124.66 3125.32 3126.09 3126.37 3128.12 3129.02 3131.04 3131.83 3132.75 3135.87 3136.56 3139.06 3142.70 3142.91 3144.52 3147.70 3149.23 3151.29 3151.72 3153.48 3154.26 3158.11 3159.22 3162.94 3167.81 3171.57 3178.51 3634.12 3715.39 3834.93 3884.16
frequency: 6.44 8.55 12.40 15.07 16.36 18.93 20.75 29.24 33.59 37.98 38.42 44.52 45.62 48.69 53.49 55.22 61.40 67.24 75.52 79.30 81.46 85.03 89.42 93.89 100.64 106.24 113.44 122.09 125.06 131.90 143.37 162.80 170.91 179.27 183.66 190.60 193.31 207.43 213.97 218.10 226.93 229.96 231.16 233.59 234.05 236.85 257.28 265.41 273.80 274.71 276.03 281.55 301.11 304.09 322.59 340.43 342.41 360.17 365.99 371.76 375.73 376.80 377.78 388.92 392.97 411.16 415.96 431.39 436.26 443.37 447.07 449.93 460.96 475.59 477.35 483.64 492.37 494.33 508.34 509.23 525.09 534.59 554.93 572.54 601.95 613.59 648.34 664.38 739.73 758.78 764.89 774.87 801.82 812.71 834.04 841.09 841.72 857.53 863.43 873.99 881.65 892.33 918.07 924.21 939.61 939.69 942.52 944.33 946.25 956.59 956.88 958.55 964.54 968.62 971.90 974.72 976.76 982.06 983.36 985.89 1016.10 1022.36 1023.50 1035.94 1057.62 1077.62 1085.23 1094.36 1100.98 1104.42 1110.34 1115.27 1121.58 1123.05 1136.18 1145.06 1154.79 1156.01 1157.68 1159.88 1168.06 1182.42 1197.18 1198.27 1199.80 1201.40 1204.79 1226.12 1248.66 1255.70 1260.77 1277.26 1279.57 1294.85 1309.65 1316.73 1322.00 1328.14 1334.20 1353.35 1370.95 1374.90 1379.97 1380.99 1384.48 1386.33 1397.38 1398.28 1403.30 1406.07 1408.24 1412.33 1420.32 1425.65 1425.91 1426.30 1427.28 1430.66 1431.56 1432.36 1435.40 1437.80 1439.01 1442.80 1448.65 1462.43 1474.23 1474.97 1478.00 1480.33 1484.48 1485.94 1486.82 1488.32 1488.94 1491.51 1492.69 1493.14 1494.41 1495.11 1496.77 1499.08 1502.27 1504.59 1504.91 1505.20 1505.94 1510.34 1511.53 1511.96 1512.24 1513.65 1518.26 1619.57 1659.17 1697.05 1752.31 1770.90 1813.59 2872.34 3010.74 3028.74 3046.24 3047.91 3048.52 3051.28 3051.67 3054.27 3055.84 3056.50 3056.53 3059.50 3060.37 3060.78 3061.04 3063.45 3064.06 3072.33 3094.61 3097.96 3107.70 3119.63 3124.66 3125.32 3126.09 3126.37 3128.12 3129.02 3131.04 3131.83 3132.75 3135.87 3136.56 3139.06 3142.70 3142.91 3144.52 3147.70 3149.23 3151.29 3151.72 3153.48 3154.26 3158.11 3159.22 3162.94 3167.81 3171.57 3178.51 3634.12 3715.39 3834.93 3884.16
formula: C30H54O8Ag
InChI: InChI=1S/C21H30O5.3C3H8O.Ag/c1-12(2)7-8-15-18(23)17(16(22)11-14(5)6)20(25)21(26,19(15)24)10-9-13(3)4;3*1-3(2)4;/h7,9,14-15,22,26H,8,10-11H2,1-6H3;3*3-4H,1-2H3;
93 atoms
C  -1.788029 -1.576914 -0.901941
C  -2.811062 -0.617079 -1.262493
C  -3.115368 0.484098 -0.37988
C  -2.41373 0.663812 0.960123
C  -1.246739 -0.259907 1.198436
C  -1.300659 -1.625345 0.556339
C  -2.090648 2.135464 1.240178
H  -3.026235 2.691301 1.156923
H  -1.770474 2.205716 2.276127
C  -3.499139 -0.695039 -2.494455
C  -3.359083 -1.783472 -3.496829
H  -3.815341 -1.42993 -4.422208
H  -2.304496 -1.986716 -3.66661
O  -4.36765 0.205382 -2.804945
O  -3.949894 1.345795 -0.678471
O  -0.318489 0.046774 1.908572
O  -1.283017 -2.400466 -1.644155
O  -0.015036 -2.187033 0.572049
H  -0.002557 -2.782648 -0.19263
C  -2.312961 -2.513035 1.337185
H  -3.324778 -2.149884 1.157903
H  -2.246681 -3.501133 0.872211
C  -4.056863 -3.087526 -3.046039
H  -3.622454 -3.386234 -2.088552
C  -5.557837 -2.889218 -2.862098
H  -5.788101 -2.138804 -2.103472
H  -6.029353 -3.82254 -2.553789
H  -6.028086 -2.570714 -3.794813
C  -3.757794 -4.185321 -4.060087
H  -4.225128 -5.123451 -3.759894
H  -2.684766 -4.357168 -4.15221
H  -4.146176 -3.922304 -5.04655
C  -1.095025 2.752907 0.288253
H  -1.153836 2.430332 -0.750062
C  -0.367966 3.881632 0.535541
C  0.302829 4.624945 -0.591624
H  -0.26629 5.533324 -0.804901
H  1.311559 4.941625 -0.324981
H  0.347707 4.034559 -1.506191
C  -0.435114 4.629049 1.840225
H  0.532258 5.060736 2.096304
H  -0.774348 4.015026 2.67153
H  -1.136803 5.460572 1.731791
C  -1.997035 -2.597965 2.797231
H  -0.98859 -2.928584 3.024371
C  -2.818173 -2.328739 3.811474
C  -2.35258 -2.497859 5.230342
H  -2.512257 -1.582991 5.8081
H  -1.298599 -2.766163 5.285339
H  -2.929155 -3.278464 5.731653
C  -4.240099 -1.866698 3.678161
H  -4.905531 -2.526569 4.238146
H  -4.599317 -1.832884 2.651912
H  -4.347851 -0.867327 4.106688
H  -4.411453 0.867908 -2.041557
Ag 0.989346 1.95295 0.870852
C  1.704232 2.223255 4.178951
H  1.583831 2.046765 5.24743
H  0.713217 2.172247 3.721639
H  2.11299 3.226081 4.043572
C  2.630452 1.188273 3.580224
H  2.14853 0.206628 3.625001
C  3.985423 1.136541 4.256749
H  4.637054 0.405048 3.777176
H  4.471298 2.11178 4.212476
H  3.877008 0.849922 5.303033
O  2.804808 1.526871 2.183588
H  3.151828 0.760282 1.717177
C  2.46104 -0.232543 -1.315984
O  1.958393 -0.121684 0.026244
H  1.362783 -0.860592 0.235276
C  1.34737 -0.022329 -2.324915
H  0.901303 0.967664 -2.19336
H  1.733514 -0.08503 -3.342465
H  0.567636 -0.77636 -2.219147
C  -2.778406 1.433255 5.380646
O  -2.212916 0.964437 4.15616
H  -1.612846 0.23718 4.329459
C  -3.678591 2.5954 5.017925
H  -4.434319 2.286185 4.295665
H  -4.18656 2.980898 5.901315
H  -3.092592 3.405544 4.578964
C  -1.692171 1.815544 6.369803
H  -2.126421 2.145447 7.313865
H  -1.040014 0.965727 6.584225
H  -1.081521 2.626692 5.968969
H  -3.392199 0.634209 5.81664
C  3.570347 0.787763 -1.453416
H  4.01654 0.739077 -2.445878
H  3.179239 1.799751 -1.312104
H  4.356952 0.615077 -0.719106
H  2.877324 -1.23766 -1.433386
H  -3.149815 0.359665 1.718638
totalener: -1924.60220978 hartree
nucrepener: 5662.01868226 hartree
electener: -7586.62089204 hartree
twoeener: 6342.63460153 hartree
kineticenergy: 1825.84480387 hartree
xcener: -182.240688186638 hartree
chargesum: 1.0000000
charge: 0.058518 -0.195617 0.120279 0.143880 0.034009 0.667670 -0.079161 0.133841 0.071162 0.270049 -0.132204 0.115249 0.120548 -0.229759 -0.386109 -0.367071 -0.400066 -0.388026 0.217098 -0.230728 0.109553 0.120686 -0.001211 0.050119 -0.244310 0.080607 0.096398 0.092041 -0.265017 0.093234 0.095110 0.089170 -0.279604 0.152509 0.135038 -0.213540 0.123870 0.100934 0.087439 -0.234278 0.108303 0.074191 0.132302 -0.144541 0.109393 -0.082573 -0.211804 0.073295 0.093793 0.112434 -0.243288 0.116035 0.080478 0.093010 0.239862 0.327356 -0.234999 0.107585 0.021602 0.109011 0.148908 0.085273 -0.221160 0.082542 0.092433 0.087736 -0.345899 0.213455 0.161430 -0.440028 0.257487 -0.268856 0.056017 0.112245 0.105149 0.084149 -0.363613 0.202168 -0.233624 0.092035 0.104749 0.075747 -0.238646 0.104695 0.080543 0.076415 0.059622 -0.261941 0.108834 0.071345 0.097364 0.097042 0.102629
charge: -0.269656 -0.138229 -0.216694 -0.047987 -0.209809 -0.248335 0.006788 0.043702 0.024771 -0.102656 0.007011 0.042318 0.034084 0.446125 0.196347 0.205360 0.145937 0.347657 -0.133604 0.000845 0.028699 0.042420 -0.097069 0.023889 0.015276 0.009782 0.019351 0.020981 0.019635 0.018849 0.017013 0.018829 -0.026642 0.035474 -0.097892 0.032407 0.033850 0.028716 0.026184 0.035838 0.030726 0.020627 0.035738 -0.031108 0.022184 -0.101560 0.016871 0.015432 0.021169 0.027128 0.016800 0.028342 0.009331 0.021903 -0.173973 0.211967 0.013220 0.024954 0.012418 0.024272 -0.169811 0.021796 0.012673 0.014799 0.021572 0.022549 0.335714 -0.122966 -0.184889 0.319260 -0.150817 0.009758 0.015045 0.025501 0.012973 -0.213736 0.296390 -0.142271 0.008842 0.014413 0.022545 0.013218 0.003621 0.023177 0.010078 0.013773 0.006916 0.015647 0.026214 0.019677 0.018053 0.022241 0.072042
qa: 0.0585 -0.1956 0.1203 0.1439 0.0340 0.6677 -0.0792 0.1338 0.0712 0.2700 -0.1322 0.1152 0.1205 -0.2298 -0.3861 -0.3671 -0.4001 -0.3880 0.2171 -0.2307 0.1096 0.1207 -0.0012 0.0501 -0.2443 0.0806 0.0964 0.0920 -0.2650 0.0932 0.0951 0.0892 -0.2796 0.1525 0.1350 -0.2135 0.1239 0.1009 0.0874 -0.2343 0.1083 0.0742 0.1323 -0.1445 0.1094 -0.0826 -0.2118 0.0733 0.0938 0.1124 -0.2433 0.1160 0.0805 0.0930 0.2399 0.3274 -0.2350 0.1076 0.0216 0.1090 0.1489 0.0853 -0.2212 0.0825 0.0924 0.0877 -0.3459 0.2135 0.1614 -0.4400 0.2575 -0.2689 0.0560 0.1122 0.1051 0.0841 -0.3636 0.2022 -0.2336 0.0920 0.1047 0.0757 -0.2386 0.1047 0.0805 0.0764 0.0596 -0.2619 0.1088 0.0713 0.0974 0.0970 0.1026
va: 4.0875 3.3597 4.0173 3.8135 3.9675 3.3627 3.8388 1.0169 1.0687 3.8899 3.8108 1.0236 1.0253 2.3352 2.1343 2.0222 2.0462 2.0811 1.0537 3.9421 1.0051 1.0170 3.8645 1.0189 3.9230 1.0093 1.0064 1.0085 3.9436 1.0074 1.0052 1.0039 3.8271 1.0230 3.6847 3.9434 0.9987 1.0030 1.0058 3.9548 1.0058 1.0034 0.9987 3.7941 1.0307 3.7349 3.9300 0.9995 1.0070 1.0020 3.9222 1.0044 1.0113 1.0006 1.1060 1.4482 3.8957 1.0117 1.0161 1.0102 3.7984 0.9976 3.9767 1.0086 1.0056 1.0113 2.0657 1.0319 3.8014 1.9757 1.0422 3.9162 1.0126 1.0182 1.0189 3.9163 2.0051 1.0243 3.9131 1.0085 1.0122 1.0068 3.9332 1.0179 1.0065 1.0034 0.9808 3.9303 1.0120 1.0017 1.0112 0.9933 1.0424
dispcorr: -0.065738199 hartree
energy: -1924.667948728225
dipole: -133.87789 134.44856 0.57066 -111.26828 111.69971 0.43143 21.69138 -21.24273 0.44865
magnitude: 0.84444 au
magnitude: 2.14639 debye
temp: 298.15 k
press: 1.00 atm
zeropoint: 0.81245513 hartree
thermalvibcorrection: 0.04881799 hartree
thermalrotcorrection: 0.00141627 hartree
thermaltrasncorrection: 0.00141627 hartree
thermaltotal: -1923.80384307 hartree
thermalcorr: 0.05165053 hartree
nonthermalcorr: 0.81245513 hartree
totalcorr: 0.86410566 hartree
thermalcorrenthalpy: 0.00094421 hartree
totalenthalpy: -1923.80289886 hartree
totalentropycorr: -0.13166287 hartree
gibbsenthalpy: -1923.93456173 hartree
gibbsminuselec: 0.73338700 hartree
