program: Orca
programVersion: 5.0.1
elementType: C C C C C C C H H H C C H H O O O O O H C H H C H C H H H C H H H C H C C H H H C H H H C H C C H H H C H H H H Ag
elementType: Ag
charge: 1
multiplicity: 1
keywords: wB97X-D3 def2-TZVPP defgrid3 ESD(ABS)
formula: C21H30O5Ag
InChI: InChI=1S/C21H30O5.Ag/c1-12(2)7-8-15-18(23)17(16(22)11-14(5)6)20(25)21(26,19(15)24)10-9-13(3)4;/h7,9,14-15,22,26H,8,10-11H2,1-6H3;
57 atoms
C  -1.852093 -0.727549 -0.093435
C  -2.444281 0.572853 0.101516
C  -1.721015 1.74507 -0.346523
C  -0.517044 1.580881 -1.270895
C  0.272718 0.319972 -1.057771
C  -0.31839 -0.782068 -0.195353
C  0.355314 2.835822 -1.390438
H  1.075399 2.66862 -2.187227
H  -0.295342 3.649161 -1.713535
H  -0.984614 1.404658 -2.253639
C  -3.70503 0.7403 0.703732
C  -4.620726 -0.361274 1.09127
H  -4.0416 -1.198465 1.477064
H  -5.277965 0.017269 1.875418
O  -4.151474 1.927476 0.946891
O  -2.115364 2.885405 -0.112866
O  1.37089 0.171489 -1.556428
O  -2.414235 -1.806557 -0.108193
O  0.036635 -2.02405 -0.732528
H  -0.765565 -2.572643 -0.674199
C  0.276698 -0.591058 1.248904
H  0.476239 0.466374 1.429563
H  -0.488695 -0.888477 1.96908
C  -5.473672 -0.8614 -0.100478
H  -4.784739 -1.152938 -0.896788
C  -6.24416 -2.102379 0.335303
H  -6.922156 -1.873295 1.160622
H  -5.568591 -2.895022 0.659249
H  -6.844536 -2.488583 -0.488474
C  -6.41002 0.221051 -0.626108
H  -5.873054 1.098267 -0.989526
H  -7.100171 0.554574 0.151772
H  -7.004394 -0.165532 -1.454084
C  1.025547 3.232782 -0.107997
H  0.349114 3.496171 0.700517
C  2.332296 3.398278 0.101008
C  3.405611 3.126372 -0.912675
H  3.045471 2.616856 -1.802749
H  3.879198 4.060914 -1.221876
H  4.195278 2.514465 -0.46927
C  2.832693 3.947036 1.407244
H  3.593009 3.29709 1.847411
H  2.02887 4.083179 2.129228
H  3.311828 4.915889 1.248216
C  1.491233 -1.445976 1.516668
H  1.277416 -2.504068 1.637452
C  2.736447 -1.027951 1.858056
C  3.144337 0.414646 1.915867
H  2.498178 1.073249 1.339046
H  4.169145 0.541255 1.565712
H  3.127651 0.746388 2.957188
C  3.743848 -2.001625 2.408651
H  3.894105 -1.787451 3.469511
H  4.718098 -1.88947 1.931549
H  3.417799 -3.036649 2.317969
H  -3.475477 2.59167 0.618728
Ag 2.514688 -1.695385 -0.654187
totalener: -1341.37336068 hartree
nucrepener: 2978.96721517 hartree
electener: -4320.34057584 hartree
oneelecener: -7789.38750694 hartree
twoeener: 3469.04693110 hartree
kineticenergy: 1245.53584079 hartree
xcener: -125.184998943202 hartree
chargesum: 1.0000000
charge: 0.159866 -0.258359 0.163296 0.097877 0.082727 0.653229 -0.068643 0.109871 0.123715 0.125085 0.282841 -0.130829 0.107924 0.120752 -0.224077 -0.376917 -0.380332 -0.387970 -0.381598 0.220473 -0.345339 0.135284 0.138232 -0.003492 0.065714 -0.264091 0.088064 0.092290 0.094515 -0.241317 0.081539 0.089469 0.096328 -0.273232 0.121463 -0.026925 -0.221810 0.088097 0.121230 0.070522 -0.207030 0.075593 0.091507 0.116189 -0.120751 0.180199 -0.029112 -0.172972 0.035088 0.107025 0.141859 -0.182351 0.125036 0.101732 0.097049 0.240889 0.454579
charge: -0.262393 -0.136540 -0.222031 -0.050500 -0.178280 -0.237339 -0.001195 0.029636 0.041081 0.078103 -0.105232 0.007129 0.036385 0.043884 0.453841 0.198333 0.210675 0.157024 0.349666 -0.120536 0.023479 0.039620 0.047010 -0.095688 0.025288 0.019408 0.018700 0.015886 0.019960 0.015937 0.009601 0.020580 0.020344 -0.040860 0.017686 -0.104248 0.019029 0.013056 0.029997 0.018361 0.017847 0.015243 0.021368 0.028605 -0.022200 0.040228 -0.072435 0.032570 0.020943 0.030869 0.039182 0.037285 0.038162 0.028037 0.028461 -0.157280 0.448256
qa: 0.1599 -0.2584 0.1633 0.0979 0.0827 0.6532 -0.0686 0.1099 0.1237 0.1251 0.2828 -0.1308 0.1079 0.1208 -0.2241 -0.3769 -0.3803 -0.3880 -0.3816 0.2205 -0.3453 0.1353 0.1382 -0.0035 0.0657 -0.2641 0.0881 0.0923 0.0945 -0.2413 0.0815 0.0895 0.0963 -0.2732 0.1215 -0.0269 -0.2218 0.0881 0.1212 0.0705 -0.2070 0.0756 0.0915 0.1162 -0.1208 0.1802 -0.0291 -0.1730 0.0351 0.1070 0.1419 -0.1824 0.1250 0.1017 0.0970 0.2409 0.4546
va: 4.0890 3.4772 4.0723 3.8381 3.9987 3.2764 3.8500 1.0165 1.0199 1.0084 3.9106 3.8248 1.0246 1.0231 2.3450 2.1297 2.0781 2.0837 2.0099 1.0667 4.0238 0.9864 1.0062 3.8346 1.0248 3.9450 1.0034 1.0055 1.0083 3.9251 1.0118 1.0077 1.0068 3.7732 1.0207 3.7375 3.9239 1.0140 1.0021 1.0027 3.9170 1.0009 1.0075 1.0001 3.5807 1.0313 3.8018 3.9328 1.0274 1.0034 0.9957 3.9229 0.9990 1.0003 1.0082 1.0970 1.0348
energy: 35163.1 35723.2 36797.4 38037.8 40815.9 40889.7 41303.7 43463.9 44681.8 44883.6 45719.6 46108.3 46590.2 47203.5 49134.5
dispcorr: -0.035687220 hartree
energy: -1341.248833109247
dipole: -179.36818 181.14073 1.77255 128.05527 -129.07607 -1.02080 58.42777 -57.77248 0.65529
magnitude: 2.14787 au
magnitude: 5.45946 debye
