program: Orca
programVersion: 5.0.1
elementType: C C C C C C C H H H C C H H O O O O O H C H H C H C H H H C H H H C H C C H H H C H H H C H C C H H H C H H H H Ag
elementType: Ag
charge: 1
multiplicity: 1
keywords: wB97X-D3 def2-TZVPP defgrid3 ESD(ABS)
formula: C21H30O5Ag
InChI: InChI=1S/C21H30O5.Ag/c1-12(2)7-8-15-18(23)17(16(22)11-14(5)6)20(25)21(26,19(15)24)10-9-13(3)4;/h7,9,14-15,22,26H,8,10-11H2,1-6H3;/q-1;+1
57 atoms
C  -0.360033 0.416696 -0.357044
C  0.560772 1.404059 0.140534
C  2.000515 1.171623 0.107023
C  2.596057 -0.048275 -0.561211
C  1.579649 -0.906423 -1.242868
C  0.180084 -0.995962 -0.645644
C  3.461264 -0.901703 0.424012
H  2.904059 -1.061057 1.348964
H  3.592912 -1.880601 -0.037587
H  3.272424 0.317434 -1.336485
C  0.105164 2.6294 0.696639
C  -1.304823 3.094986 0.757353
H  -1.956712 2.261836 1.010157
H  -1.358384 3.849153 1.543638
O  0.952227 3.456403 1.194754
O  2.789096 1.987839 0.586737
O  1.807656 -1.530576 -2.247988
O  -1.569964 0.59672 -0.496439
O  -0.640542 -1.650117 -1.571154
H  -0.067852 -1.928185 -2.304842
C  0.189448 -1.801337 0.690496
H  0.876167 -2.639648 0.561458
H  0.591514 -1.181381 1.490754
C  -1.780355 3.715292 -0.578473
H  -1.628359 2.971525 -1.364007
C  -3.273904 4.004274 -0.480917
H  -3.483134 4.720877 0.316433
H  -3.84263 3.095446 -0.276846
H  -3.644493 4.429955 -1.413399
C  -0.992403 4.972075 -0.932046
H  -1.102106 5.735112 -0.158638
H  -1.356527 5.393245 -1.869112
H  0.073543 4.775553 -1.054088
C  4.793257 -0.285949 0.740004
H  4.818686 0.380977 1.593225
C  5.918172 -0.483819 0.05525
C  6.029561 -1.344947 -1.169412
H  5.091201 -1.802405 -1.477725
H  6.400141 -0.751965 -2.008754
H  6.758522 -2.142018 -1.007762
C  7.196939 0.179537 0.475061
H  7.967387 -0.567439 0.679374
H  7.064793 0.790136 1.366414
H  7.580222 0.816464 -0.325462
C  -1.153293 -2.381289 1.078554
H  -1.353795 -3.372521 0.681068
C  -1.998522 -1.912371 2.024898
C  -1.78006 -0.634405 2.782026
H  -2.693648 -0.038939 2.807616
H  -0.982062 -0.017105 2.375898
H  -1.534747 -0.870507 3.820054
C  -3.15162 -2.748192 2.512928
H  -2.950158 -3.06383 3.53922
H  -3.301147 -3.643642 1.911233
H  -4.081438 -2.178413 2.544194
H  1.883775 3.060252 1.072242
Ag -2.810198 -1.364061 -0.480896
totalener: -1341.37077489 hartree
nucrepener: 2962.02380622 hartree
electener: -4303.39458111 hartree
oneelecener: -7755.48651436 hartree
twoeener: 3452.09193325 hartree
kineticenergy: 1245.55102201 hartree
xcener: -125.183802440419 hartree
chargesum: 1.0000000
charge: 0.160845 -0.235870 0.112001 0.183432 0.103795 0.692655 -0.193528 0.113829 0.133946 0.121955 0.255893 -0.101628 0.087256 0.125480 -0.225330 -0.351316 -0.298276 -0.472284 -0.380126 0.212184 -0.373417 0.142359 0.136329 -0.010348 0.065081 -0.263187 0.092601 0.077694 0.099311 -0.241073 0.090935 0.097583 0.085587 -0.176657 0.088120 -0.027575 -0.229819 0.070280 0.098587 0.104318 -0.195365 0.094348 0.083967 0.090542 -0.196397 0.181434 0.003073 -0.213228 0.107095 0.071634 0.141098 -0.193782 0.125282 0.097503 0.100451 0.243291 0.487430
charge: -0.230580 -0.131454 -0.205532 -0.047954 -0.224942 -0.235028 -0.001328 0.025844 0.033377 0.069360 -0.104965 0.003691 0.028752 0.044580 0.451475 0.231413 0.196284 0.166067 0.358705 -0.118372 0.012449 0.046873 0.033965 -0.095499 0.025034 0.018628 0.020187 0.011585 0.021076 0.018431 0.021229 0.021101 0.011546 -0.037198 0.015013 -0.091020 0.020302 0.010820 0.027205 0.027361 0.024042 0.024020 0.020673 0.023048 -0.017747 0.039008 -0.071825 0.036385 0.032777 0.017661 0.039063 0.035653 0.037472 0.028681 0.027876 -0.176701 0.431433
qa: 0.1608 -0.2359 0.1120 0.1834 0.1038 0.6927 -0.1935 0.1138 0.1339 0.1220 0.2559 -0.1016 0.0873 0.1255 -0.2253 -0.3513 -0.2983 -0.4723 -0.3801 0.2122 -0.3734 0.1424 0.1363 -0.0103 0.0651 -0.2632 0.0926 0.0777 0.0993 -0.2411 0.0909 0.0976 0.0856 -0.1767 0.0881 -0.0276 -0.2298 0.0703 0.0986 0.1043 -0.1954 0.0943 0.0840 0.0905 -0.1964 0.1814 0.0031 -0.2132 0.1071 0.0716 0.1411 -0.1938 0.1253 0.0975 0.1005 0.2433 0.4874
va: 3.8861 3.4288 4.1389 3.6955 4.0955 3.2409 3.9385 1.0045 1.0048 1.0331 3.9231 3.8025 1.0283 1.0227 2.3412 2.1806 2.1688 1.9557 2.0276 1.0744 4.0807 1.0098 0.9945 3.8366 1.0223 3.9445 1.0038 1.0064 1.0084 3.9307 1.0073 1.0064 1.0108 3.8589 1.0316 3.8006 3.9395 1.0148 1.0000 1.0018 3.9409 0.9995 1.0110 1.0009 3.6816 1.0177 3.6445 3.9669 1.0051 1.0069 1.0012 3.9232 0.9999 1.0074 0.9990 1.1081 0.9476
energy: 34161.8 35137.6 36090.0 37344.5 39632.5 40321.2 41524.4 42369.9 42967.4 44289.1 44924.8 44946.4 46046.6 46915.9 48682.2
dispcorr: -0.034463599 hartree
energy: -1341.249586055953
dipole: 207.39250 -209.21777 -1.82526 104.46958 -105.64916 -1.17957 44.82522 -43.88731 0.93791
magnitude: 2.36699 au
magnitude: 6.01642 debye
