program: Orca
programVersion: 5.0.1
elementType: C C C C C C C H H H C C H H O O O O O H C H H C H C H H H C H H H C H C C H H H C H H H C H C C H H H C H H H H Ag
elementType: Ag
charge: 1
multiplicity: 1
keywords: wB97X-D3 def2-TZVPP defgrid3 ESD(ABS)
formula: C21H30O5Ag
InChI: InChI=1S/C21H30O5.Ag/c1-12(2)7-8-15-18(23)17(16(22)11-14(5)6)20(25)21(26,19(15)24)10-9-13(3)4;/h7,9,14-15,22,26H,8,10-11H2,1-6H3;
57 atoms
C  1.330574 1.347359 -0.949583
C  2.319237 0.291475 -0.930006
C  1.888102 -1.062146 -1.219312
C  0.489389 -1.321018 -1.775033
C  -0.555097 -0.332984 -1.33994
C  -0.120162 0.941605 -0.636755
C  0.032424 -2.785382 -1.668254
H  -0.791813 -2.920995 -2.369014
H  0.851897 -3.408423 -2.015757
H  0.60969 -1.087205 -2.845882
C  3.689447 0.530472 -0.712774
C  4.32232 1.854429 -0.457489
H  5.282217 1.838997 -0.975742
H  3.708744 2.643647 -0.877946
O  4.520019 -0.458716 -0.699393
O  2.66368 -2.015022 -1.166728
O  -1.737331 -0.540494 -1.532252
O  1.508192 2.536844 -1.126431
O  -0.959972 1.988217 -1.02942
H  -0.371075 2.744005 -1.203498
C  -0.228956 0.674022 0.909577
H  -0.037067 -0.379785 1.117391
H  0.569162 1.234745 1.400435
C  4.580214 2.143413 1.045164
H  5.008268 3.148768 1.049508
C  3.290086 2.185017 1.858347
H  2.564567 2.876058 1.42577
H  3.495023 2.508627 2.878791
H  2.836221 1.191458 1.922311
C  5.598687 1.199218 1.674309
H  5.213394 0.18164 1.755804
H  5.849062 1.537444 2.680224
H  6.521292 1.158407 1.095101
C  -0.425799 -3.184812 -0.294554
H  -1.416867 -2.828208 -0.026441
C  0.198524 -3.975262 0.58034
C  -0.445688 -4.322426 1.892968
H  0.161369 -3.967005 2.729551
H  -1.44744 -3.905208 1.98556
H  -0.522505 -5.405967 2.003198
C  1.537963 -4.613963 0.3654
H  2.232406 -4.300448 1.148546
H  1.988301 -4.371105 -0.591469
H  1.44679 -5.699216 0.445716
C  -1.530312 1.146547 1.509185
H  -1.633152 2.227015 1.556896
C  -2.443364 0.414776 2.196769
C  -2.350877 -1.069262 2.391182
H  -2.061248 -1.273856 3.424776
H  -1.625403 -1.545674 1.737762
H  -3.320644 -1.545164 2.241075
C  -3.521784 1.09594 2.996383
H  -4.499398 0.644232 2.824145
H  -3.58064 2.164337 2.793933
H  -3.30541 0.966248 4.059433
H  4.002249 -1.305776 -0.85649
Ag -3.114031 0.918279 -0.289317
totalener: -1341.36862958 hartree
nucrepener: 3016.56900539 hartree
electener: -4357.93763497 hartree
oneelecener: -7864.48791393 hartree
twoeener: 3506.55027896 hartree
kineticenergy: 1245.53573873 hartree
xcener: -125.188282102387 hartree
chargesum: 1.0000000
charge: 0.185389 -0.272999 0.185238 0.096993 0.098112 0.626010 -0.090258 0.121478 0.113712 0.125617 0.304025 -0.166229 0.124891 0.141494 -0.234444 -0.392712 -0.377633 -0.376803 -0.379170 0.219499 -0.371437 0.141373 0.142653 0.048178 0.062188 -0.322889 0.103320 0.116588 0.067231 -0.257483 0.075267 0.098130 0.099732 -0.295050 0.111781 0.017819 -0.218568 0.095291 0.070708 0.111651 -0.214644 0.087787 0.089248 0.107140 -0.104855 0.186467 -0.052859 -0.129718 0.137323 0.004918 0.111490 -0.186770 0.102984 0.096627 0.124743 0.239183 0.452242
charge: -0.258510 -0.135791 -0.214412 -0.048546 -0.179478 -0.238273 -0.000042 0.036796 0.033094 0.077912 -0.101333 0.013336 0.046596 0.029827 0.453497 0.207182 0.209938 0.160289 0.348810 -0.122377 0.022417 0.038185 0.044877 -0.088301 0.035231 0.006732 0.013115 0.021641 0.007160 0.015278 0.010626 0.019587 0.019377 -0.051277 0.008376 -0.090263 0.017718 0.021385 0.013628 0.027711 0.021699 0.024806 0.012086 0.026880 -0.023688 0.040940 -0.071426 0.033916 0.039571 0.014380 0.033289 0.037208 0.028691 0.028379 0.037621 -0.166595 0.450525
qa: 0.1854 -0.2730 0.1852 0.0970 0.0981 0.6260 -0.0903 0.1215 0.1137 0.1256 0.3040 -0.1662 0.1249 0.1415 -0.2344 -0.3927 -0.3776 -0.3768 -0.3792 0.2195 -0.3714 0.1414 0.1427 0.0482 0.0622 -0.3229 0.1033 0.1166 0.0672 -0.2575 0.0753 0.0981 0.0997 -0.2951 0.1118 0.0178 -0.2186 0.0953 0.0707 0.1117 -0.2146 0.0878 0.0892 0.1071 -0.1049 0.1865 -0.0529 -0.1297 0.1373 0.0049 0.1115 -0.1868 0.1030 0.0966 0.1247 0.2392 0.4522
va: 4.0350 3.4437 4.0455 3.8378 3.9850 3.2802 3.8750 1.0142 1.0217 1.0079 3.8515 3.8061 1.0194 1.0317 2.3350 2.1201 2.0826 2.0941 2.0104 1.0690 4.0382 0.9827 1.0116 3.8765 1.0125 3.9453 1.0040 1.0138 0.9977 3.9449 1.0092 1.0062 1.0093 3.7877 1.0043 3.6833 3.9237 0.9989 1.0076 1.0041 3.9238 1.0023 1.0224 1.0026 3.5933 1.0289 3.8062 3.9204 0.9999 1.0383 1.0049 3.9275 0.9997 1.0078 0.9996 1.1019 1.0372
energy: 35226.9 35547.4 36612.5 37730.3 40252.9 40754.0 41045.3 44262.1 44466.3 44927.4 45126.8 45809.3 46182.9 46941.4 49170.8
dispcorr: -0.036733781 hartree
energy: -1341.244857800129
dipole: 231.39254 -232.89378 -1.50124 -76.34942 76.93549 0.58607 47.61809 -46.49859 1.11950
magnitude: 1.96227 au
magnitude: 4.98768 debye
