program: Orca
programVersion: 5.0.2
elementType: C C C C C C C H H H C C H H O O O O O H C H H C H C H H H C H H H C H C C H H H C H H H C H C C H H H C H H H H Ag
elementType: Ag
charge: 1
multiplicity: 1
keywords: wB97X-D3 def2-TZVPP defgrid3 ESD(ABS)
formula: C21H30O5Ag
InChI: InChI=1S/C21H30O5.Ag/c1-12(2)7-8-15-18(23)17(16(22)11-14(5)6)20(25)21(26,19(15)24)10-9-13(3)4;/h7,9,14-15,22,26H,8,10-11H2,1-6H3;
57 atoms
C  0.937174 -0.58392 1.050204
C  2.00661 0.384377 0.855542
C  1.728856 1.777777 1.112385
C  0.302434 2.225373 1.366258
C  -0.616713 1.191995 1.981847
C  -0.081997 -0.237965 2.16523
C  -0.323917 2.768231 0.056164
H  -1.325223 3.122518 0.293225
H  0.263438 3.641746 -0.23922
H  0.348283 3.065799 2.060324
C  3.279048 0.025869 0.39563
C  3.72338 -1.338577 0.003999
H  4.673372 -1.515282 0.51254
H  3.004489 -2.085515 0.326479
O  4.203568 0.924711 0.27774
O  2.58123 2.660097 1.000154
O  -1.718642 1.496348 2.360144
O  0.805392 -1.618557 0.424593
O  0.711809 -0.199973 3.338477
H  0.149078 -0.034305 4.099113
C  -1.199235 -1.280244 2.264969
H  -0.732071 -2.261785 2.264834
H  -1.677257 -1.144382 3.237866
C  3.953326 -1.453326 -1.519778
H  4.753744 -0.756229 -1.780132
C  4.41399 -2.867655 -1.851135
H  3.637736 -3.597021 -1.608265
H  5.312781 -3.135697 -1.294751
H  4.63941 -2.961515 -2.913626
C  2.710724 -1.076276 -2.323045
H  2.897536 -1.199055 -3.39011
H  2.429499 -0.03217 -2.160212
H  1.862789 -1.706182 -2.046778
C  -0.322932 1.825048 -1.123459
H  0.629224 1.343575 -1.338109
C  -1.259598 1.766019 -2.11578
C  -2.535514 2.56192 -2.102476
H  -2.856654 2.853235 -1.10516
H  -2.383575 3.475155 -2.683733
H  -3.344797 2.01444 -2.585286
C  -0.93306 1.096874 -3.427753
H  -1.752819 0.472624 -3.785874
H  -0.021878 0.501669 -3.377613
H  -0.785031 1.872877 -4.18294
C  -2.312359 -1.193896 1.244055
H  -3.052785 -0.426487 1.454759
C  -2.645688 -2.122996 0.301324
C  -3.989438 -2.058635 -0.38052
H  -4.517901 -1.126765 -0.182562
H  -3.907406 -2.207122 -1.458216
H  -4.606243 -2.878835 -0.005244
C  -1.86318 -3.376996 0.044042
H  -1.877819 -3.633866 -1.015465
H  -2.352196 -4.200683 0.570938
H  -0.831897 -3.309248 0.374692
H  3.817369 1.810429 0.548145
Ag -1.552397 -0.133704 -0.674692
totalener: -1341.37633762 hartree
nucrepener: 3131.69188495 hartree
electener: -4473.06822257 hartree
oneelecener: -8093.31770745 hartree
twoeener: 3620.24948487 hartree
kineticenergy: 1245.30205674 hartree
xcener: -125.163223109446 hartree
chargesum: 1.0000000
charge: 0.166758 -0.243162 0.126871 0.233775 -0.110168 0.539340 -0.242455 0.132196 0.144937 0.122497 0.300443 -0.153560 0.124963 0.102442 -0.238473 -0.362362 -0.280999 -0.401165 -0.296354 0.190911 -0.279820 0.133128 0.121609 0.056473 0.073022 -0.269402 0.082982 0.095979 0.094238 -0.333701 0.115546 0.080782 0.091295 -0.216584 0.205175 0.101043 -0.218938 0.101453 0.137907 0.103844 -0.196945 0.097071 0.091577 0.131155 -0.204315 0.220865 0.103059 -0.195633 0.095749 0.097112 0.129676 -0.238890 0.094142 0.135153 0.118415 0.238551 0.150789
charge: -0.253225 -0.133087 -0.228726 -0.046267 -0.237993 -0.248326 0.018861 0.040045 0.052040 0.065886 -0.111040 0.010499 0.046940 0.031592 0.445683 0.189820 0.189663 0.159743 0.341834 -0.113686 0.006255 0.042019 0.044980 -0.090761 0.031137 0.018905 0.017002 0.018837 0.019212 0.006415 0.019612 0.005004 0.015052 -0.015872 0.037528 -0.095203 0.040858 0.026105 0.041542 0.032241 0.039161 0.029596 0.030756 0.040552 -0.028165 0.041834 -0.080896 0.035408 0.028792 0.027811 0.039924 0.038607 0.030497 0.038659 0.020671 -0.159887 0.385554
qa: 0.1668 -0.2432 0.1269 0.2338 -0.1102 0.5393 -0.2425 0.1322 0.1449 0.1225 0.3004 -0.1536 0.1250 0.1024 -0.2385 -0.3624 -0.2810 -0.4012 -0.2964 0.1909 -0.2798 0.1331 0.1216 0.0565 0.0730 -0.2694 0.0830 0.0960 0.0942 -0.3337 0.1155 0.0808 0.0913 -0.2166 0.2052 0.1010 -0.2189 0.1015 0.1379 0.1038 -0.1969 0.0971 0.0916 0.1312 -0.2043 0.2209 0.1031 -0.1956 0.0957 0.0971 0.1297 -0.2389 0.0941 0.1352 0.1184 0.2386 0.1508
va: 3.6859 3.3370 4.1261 3.6429 4.1834 3.3834 4.0751 1.0148 1.0030 1.0316 3.8816 3.8529 1.0204 1.0373 2.3379 2.1599 2.1753 2.0136 2.1384 1.0450 4.0589 1.0213 1.0119 3.8330 1.0235 3.9528 1.0015 1.0068 1.0071 3.9388 1.0091 1.0039 1.0059 3.6514 1.0283 3.6850 3.9398 1.0101 0.9949 1.0067 3.9427 1.0070 1.0057 0.9981 3.7111 1.0132 3.6316 3.9208 1.0101 1.0043 0.9980 3.9505 1.0095 0.9958 1.0209 1.1006 1.6193
energy: 30902.4 34158.6 35969.3 39312.1 42547.6 44972.7 45167.9 46435.7 47144.9 48423.8 48650.2 49281.9 49760.6 50293.9 50887.6 51950.6 52572.2 53338.9 53574.5 54395.7 54660.4 55397.2 55596.9 56219.3 56356.8
dispcorr: -0.038101801 hartree
energy: -1341.273637689455
dipole: 104.68322 -106.64375 -1.96053 -4.30758 3.92558 -0.38200 24.50132 -25.71709 -1.21577
magnitude: 2.33831 au
magnitude: 5.94352 debye
