program: Orca
programVersion: 5.0.2
elementType: C C C C C C C H H H C C H H O O O O O H C H H C H C H H H C H H H C H C C H H H C H H H C H C C H H H C H H H H Ag
elementType: Ag
charge: 1
multiplicity: 1
keywords: DLPNO-CCSD(T) def2-TZVPP def2-TZVPP/C VeryTightSCF
formula: C21H30O5Ag
InChI: InChI=1S/C21H30O5.Ag/c1-12(2)7-8-15-18(23)17(16(22)11-14(5)6)20(25)21(26,19(15)24)10-9-13(3)4;/h7,9,14-15,22,26H,8,10-11H2,1-6H3;
57 atoms
C  1.974312 -0.211524 -1.537399
C  1.725298 -1.277658 -0.589706
C  0.357986 -1.75311 -0.399748
C  -0.568413 -1.633402 -1.615999
C  -0.48682 -0.271304 -2.264682
C  0.787682 0.566752 -2.11116
C  -2.000599 -2.112408 -1.358955
H  -2.456089 -2.329354 -2.326208
H  -1.946288 -3.049015 -0.810257
H  -0.111975 -2.298158 -2.36366
C  2.817676 -1.798607 0.122399
C  2.757435 -2.822196 1.202502
H  1.80199 -3.334408 1.171041
H  3.554943 -3.539275 1.00014
O  4.01572 -1.394655 -0.151998
O  -0.072269 -2.25738 0.621192
O  -1.391596 0.179783 -2.919491
O  3.100373 0.198636 -1.800291
O  1.156172 1.05026 -3.366184
H  0.354044 1.292796 -3.838697
C  0.497896 1.782838 -1.180387
H  1.390512 2.409368 -1.270142
H  -0.322607 2.331007 -1.64305
C  2.973268 -2.231467 2.622549
H  2.68595 -3.03991 3.299006
C  4.430659 -1.882313 2.905937
H  4.779978 -1.061153 2.279327
H  5.08648 -2.735631 2.73162
H  4.547367 -1.579531 3.947183
C  2.059688 -1.040959 2.905172
H  2.36334 -0.172593 2.311437
H  2.130941 -0.750662 3.953751
H  1.018108 -1.273592 2.679487
C  -2.92997 -1.13861 -0.668636
H  -3.332389 -0.361759 -1.314276
C  -3.530182 -1.297461 0.548019
C  -3.260209 -2.452928 1.468966
H  -3.32565 -2.141455 2.51174
H  -4.038921 -3.205399 1.319159
H  -2.290905 -2.912846 1.301155
C  -4.706742 -0.435254 0.932329
H  -4.857227 0.400178 0.249609
H  -4.621862 -0.058568 1.952651
H  -5.608051 -1.052652 0.908579
C  0.257011 1.545208 0.288903
H  0.944593 0.86073 0.780187
C  -0.495758 2.331028 1.115771
C  -1.31368 3.498377 0.637226
H  -0.723485 4.410081 0.762208
H  -2.21321 3.622084 1.239888
H  -1.599947 3.431841 -0.409755
C  -0.322155 2.240039 2.611464
H  -1.277931 2.255577 3.136982
H  0.228652 3.121602 2.948952
H  0.24142 1.358021 2.913331
H  3.956276 -0.698286 -0.876125
Ag -1.705498 0.319769 0.646493
totalener: -1333.36927850 hartree
nucrepener: 3126.79953648 hartree
electener: -4460.16881499 hartree
oneelecener: -8080.38412478 hartree
twoeener: 3620.21530980 hartree
kineticenergy: 1243.02608678 hartree
chargesum: 1.0000000
charge: 0.211639 -0.300618 0.286898 0.151947 0.026649 0.683293 -0.161421 0.132108 0.119973 0.135399 0.360072 -0.104908 0.105815 0.122102 -0.366476 -0.532765 -0.432346 -0.456140 -0.387392 0.233252 -0.217795 0.144993 0.103465 0.118456 0.043756 -0.224580 0.068432 0.073436 0.074631 -0.291414 0.045006 0.103358 0.070865 -0.252666 0.187323 0.125537 -0.213382 0.077287 0.118055 0.105219 -0.187210 0.079178 0.073580 0.114624 -0.270525 0.164149 0.103286 -0.205808 0.123040 0.089397 0.083253 -0.169194 0.078689 0.117662 0.068527 0.298709 0.351582
charge: -0.179546 -0.152750 -0.222167 -0.043492 -0.183073 -0.219114 0.025223 0.042049 0.035345 0.066908 -0.052976 0.027169 0.026170 0.040476 0.397574 0.083765 0.124341 0.152886 0.313335 -0.111498 0.021467 0.051142 0.034834 -0.071438 0.027006 0.029001 0.008022 0.012903 0.012749 0.015161 0.002642 0.013843 0.006374 -0.017186 0.036119 -0.066636 0.047093 0.023137 0.031395 0.019772 0.044613 0.023177 0.020257 0.033589 -0.011159 0.030877 -0.072164 0.050283 0.035822 0.025657 0.020183 0.049630 0.022680 0.034399 0.025977 -0.151846 0.410001
qa: 0.2116 -0.3006 0.2869 0.1519 0.0266 0.6833 -0.1614 0.1321 0.1200 0.1354 0.3601 -0.1049 0.1058 0.1221 -0.3665 -0.5328 -0.4323 -0.4561 -0.3874 0.2333 -0.2178 0.1450 0.1035 0.1185 0.0438 -0.2246 0.0684 0.0734 0.0746 -0.2914 0.0450 0.1034 0.0709 -0.2527 0.1873 0.1255 -0.2134 0.0773 0.1181 0.1052 -0.1872 0.0792 0.0736 0.1146 -0.2705 0.1641 0.1033 -0.2058 0.1230 0.0894 0.0833 -0.1692 0.0787 0.1177 0.0685 0.2987 0.3516
va: 3.9956 3.1181 3.8014 3.5554 4.1267 3.6182 4.0170 1.0055 1.0126 1.0152 3.8514 3.8119 1.0313 1.0167 2.1804 1.8395 2.0006 2.0382 2.0328 1.0178 4.0238 1.0085 1.0196 3.8539 1.0173 3.9874 1.0098 1.0093 1.0050 3.9765 0.9993 1.0070 1.0065 3.7843 1.0159 3.5617 3.9527 1.0093 0.9998 1.0056 3.9482 1.0071 1.0070 1.0001 3.6483 1.0190 3.6287 3.9577 0.9992 1.0069 1.0027 3.9586 1.0099 1.0004 0.9950 1.0399 1.3122
e0: -1333.369278443 hartree
corrType: DLPNO BASED
energy: -1339.023297296563
dipole: 103.79361 -106.04099 -2.24738 -41.50160 41.89109 0.38949 -12.39820 14.05468 1.65648
magnitude: 2.81893 au
magnitude: 7.16514 debye
