program: Orca
programVersion: 5.0.2
elementType: C C C C C C C H H H C C H H O O O O O H C H H C H C H H H C H H H C H C C H H H C H H H C H C C H H H C H H H H Ag
elementType: Ag
charge: 1
multiplicity: 1
keywords: DLPNO-CCSD(T) def2-TZVPP def2-TZVPP/C VeryTightSCF
formula: C21H30O5Ag
InChI: InChI=1S/C21H30O5.Ag/c1-12(2)7-8-15-18(23)17(16(22)11-14(5)6)20(25)21(26,19(15)24)10-9-13(3)4;/h7,9,14-15,22,26H,8,10-11H2,1-6H3;
57 atoms
C  0.80138 -0.569445 1.339568
C  1.670772 0.517535 0.930607
C  1.275814 1.877401 1.185055
C  -0.117229 2.203106 1.682329
C  -0.869146 1.078833 2.360133
C  -0.164517 -0.280324 2.518936
C  -0.97077 2.847159 0.557074
H  -1.759865 3.408446 1.053492
H  -0.334799 3.575996 0.054045
H  0.018689 2.983335 2.435072
C  2.900695 0.2847 0.286043
C  3.405881 -1.040876 -0.153855
H  4.494013 -0.980378 -0.20083
H  3.118324 -1.798591 0.57159
O  3.682067 1.276104 0.014879
O  1.999685 2.839527 0.908506
O  -1.968074 1.261568 2.816327
O  0.817008 -1.685693 0.85209
O  0.712444 -0.131431 3.621957
H  0.198223 -0.025529 4.42637
C  -1.159129 -1.426073 2.715108
H  -0.591817 -2.352194 2.753366
H  -1.631874 -1.282968 3.689223
C  2.850958 -1.439452 -1.541897
H  1.762449 -1.329841 -1.500009
C  3.399663 -0.549603 -2.652483
H  4.483552 -0.652127 -2.732505
H  3.186845 0.507619 -2.4875
H  2.970499 -0.832352 -3.614707
C  3.161399 -2.908784 -1.80197
H  2.778912 -3.218645 -2.775053
H  2.711809 -3.547268 -1.040707
H  4.239049 -3.085603 -1.79976
C  -1.662553 1.97066 -0.476332
H  -2.742667 1.910979 -0.353316
C  -1.172406 1.562005 -1.681203
C  0.245528 1.779966 -2.121183
H  0.875785 2.221361 -1.354911
H  0.702143 0.8466 -2.454622
H  0.24437 2.448898 -2.98473
C  -2.100347 1.081041 -2.772654
H  -2.165418 1.860037 -3.536105
H  -3.112409 0.887739 -2.416199
H  -1.71734 0.19224 -3.277236
C  -2.282373 -1.496076 1.704698
H  -3.091988 -0.794343 1.888656
C  -2.526905 -2.483127 0.79528
C  -3.867505 -2.558989 0.108683
H  -4.477323 -1.672265 0.277911
H  -3.766932 -2.729596 -0.964198
H  -4.411771 -3.419475 0.505049
C  -1.638905 -3.673085 0.580214
H  -1.602997 -3.946079 -0.47496
H  -2.076972 -4.525316 1.106428
H  -0.626065 -3.51994 0.93686
H  3.230892 2.123302 0.325872
Ag -1.609463 -0.400002 -0.249193
totalener: -1333.36661015 hartree
nucrepener: 3167.80692576 hartree
electener: -4501.17353591 hartree
oneelecener: -8162.40519161 hartree
twoeener: 3661.23165570 hartree
kineticenergy: 1243.07054408 hartree
chargesum: 1.0000000
charge: 0.291957 -0.220122 0.147387 0.290059 -0.063488 0.621256 -0.172023 0.137052 0.131086 0.128462 0.373051 -0.113274 0.125925 0.109901 -0.360929 -0.504237 -0.403097 -0.535679 -0.408401 0.230358 -0.164137 0.121869 0.113838 0.136799 -0.041394 -0.223655 0.083451 0.059567 0.074639 -0.240367 0.071218 0.074164 0.076215 -0.247175 0.160137 0.091869 -0.171723 0.091322 0.057920 0.123541 -0.203288 0.117017 0.075102 0.085017 -0.264787 0.189437 0.108961 -0.187146 0.076022 0.074097 0.115189 -0.202869 0.073253 0.116521 0.107678 0.303139 0.363310
charge: -0.216221 -0.145095 -0.184116 -0.032137 -0.193091 -0.212251 0.029054 0.041285 0.039290 0.064375 -0.043408 0.025789 0.040336 0.034869 0.398431 0.122722 0.134433 0.096370 0.300129 -0.109484 0.017297 0.037720 0.038613 -0.086790 0.011395 0.023721 0.018400 0.002430 0.011562 0.032404 0.011922 0.011040 0.016133 -0.007189 0.035899 -0.063771 0.051367 0.020687 0.024912 0.034274 0.046216 0.034983 0.024577 0.024107 -0.017112 0.035503 -0.056656 0.044497 0.022432 0.020250 0.033197 0.048009 0.022707 0.031497 0.017895 -0.153315 0.387906
qa: 0.2920 -0.2201 0.1474 0.2901 -0.0635 0.6213 -0.1720 0.1371 0.1311 0.1285 0.3731 -0.1133 0.1259 0.1099 -0.3609 -0.5042 -0.4031 -0.5357 -0.4084 0.2304 -0.1641 0.1219 0.1138 0.1368 -0.0414 -0.2237 0.0835 0.0596 0.0746 -0.2404 0.0712 0.0742 0.0762 -0.2472 0.1601 0.0919 -0.1717 0.0913 0.0579 0.1235 -0.2033 0.1170 0.0751 0.0850 -0.2648 0.1894 0.1090 -0.1871 0.0760 0.0741 0.1152 -0.2029 0.0733 0.1165 0.1077 0.3031 0.3633
va: 3.6820 3.1780 4.1356 3.4833 4.1617 3.4322 4.0275 1.0034 1.0149 1.0349 3.8365 3.8409 1.0185 1.0250 2.1858 1.9665 2.0429 1.8610 1.9950 1.0153 3.9727 1.0240 1.0130 3.7560 1.0318 3.9480 1.0146 1.0098 1.0042 3.9809 1.0065 1.0043 1.0077 3.7364 1.0164 3.5713 3.9727 1.0129 1.0072 1.0036 3.9514 0.9999 1.0047 1.0054 3.7404 1.0181 3.5477 3.9455 1.0075 1.0072 1.0013 3.9513 1.0092 0.9999 1.0070 1.0360 1.2828
e0: -1333.366610064 hartree
corrType: DLPNO BASED
energy: -1339.019239403156
dipole: 101.04602 -102.85195 -1.80593 7.36189 -8.02234 -0.66046 14.15101 -15.26345 -1.11244
magnitude: 2.22151 au
magnitude: 5.64663 debye
